{"text_format":"3","workbook":"xlsx","n_sheets":16,"sheets":["INGRESOS","AFILIACIONES Y PERMISOS 2024","AFILIACIONES Y PERMISOS 2025","GAL'S 2024  ","GAL'S 2025 ","CERTIFICADOS DE ASCENSO 2024","CERTIFICADOS DE ASCENSO 2025","III OPEN 2024","CHEQUEO TÉCNICO EDADES 2025","CURSO ARBITRAJE 12-14 DIC 2024","ACREDITACIÓN ENTRENADORES 2025","I SELECTIVO CAD, JUN Y JUV","I OPEN ASOTKD 2025 Y SELECTIVO","PAGO DERECHO SEGUNDO EXAMEN ACR","EGRESOS","CUENTAS POR COBRAR Y POR PAGAR"],"not_rendered":{"images":147,"defined_names":5},"read":"whole","date_system":"1900"}

{"sheet":"INGRESOS","index":0,"n_rows":21,"n_cols":7,"rows_kept":21,"merged":[[1,1,1,6],[9,1,14,1],[16,1,17,1],[18,1,19,1],[18,2,19,2],[20,1,20,5]]}
[]
[null,"INGRESOS DEL 05 DE SEPTIEMBRE 2024 AL 15 DE MARZO 2025"]
[null,"INGRESOS PRINCIPALES","ITEMS SECUNDARIOS","EFECTIVO","TRANSFERENCIA","INGRESO (EFE - TRANS)","VALOR (INGRESO-EGRESOS)"]
[null,"AFILIACIONES Y PERMISOS DE FUNCIONAMIENTO SEP-DIC 2024",null,{"$f":"'AFILIACIONES Y PERMISOS 2024'!F37","v":{"v":70,"d":"$ 70.00"}},{"$f":"'AFILIACIONES Y PERMISOS 2024'!F130-INGRESOS!D4","v":{"v":2590,"d":"$ 2,590.00"}},{"$f":"SUM(D4:E4)","v":{"v":2660,"d":"$ 2,660.00"}},{"$f":"SUM(D4:E4)","v":{"v":2660,"d":"$ 2,660.00"}}]
[null,"AFILIACIONES Y PERMISOS DE FUNCIONAMIENTO ENE-MAR 15",null,0,{"$f":"'AFILIACIONES Y PERMISOS 2025'!F135","v":{"v":2462.57,"d":"$ 2,462.57"}},{"$f":"SUM(D5:E5)","v":{"v":2462.57,"d":"$ 2,462.57"}},{"v":2462.57,"d":"$ 2,462.57"}]
[null,"LICENCIA DEPORTIVA ANUAL (CARNETS) SEP-DIC 2024",null,{"$f":"'GAL''S 2024  '!C172","v":{"v":332,"d":"$ 332.00"}},{"$f":"'GAL''S 2024  '!C173","v":{"v":5506,"d":"$ 5,506.00"}},{"$f":"D6+E6","v":{"v":5838,"d":"$ 5,838.00"}},{"v":5838,"d":"$ 5,838.00"}]
[null,"LICENCIA DEPORTIVA ANUAL (CARNETS) ENE-MAR 15",null,{"$f":"'GAL''S 2025 '!C153","v":{"v":802,"d":"$ 802.00"}},{"$f":"'GAL''S 2025 '!C154","v":{"v":11205.5,"d":"$ 11,205.50"}},{"$f":"D7+E7","v":{"v":12007.5,"d":"$ 12,007.50"}},{"v":12007.5,"d":"$ 12,007.50"}]
[null,"CERTIFICADOS DE ASCENSO SEP -DIC 2024",null,{"$f":"'CERTIFICADOS DE ASCENSO 2024'!C109","v":{"v":122,"d":"$ 122.00"}},{"$f":"'CERTIFICADOS DE ASCENSO 2024'!C110","v":{"v":2922.5,"d":"$ 2,922.50"}},{"$f":"D8+E8","v":{"v":3044.5,"d":"$ 3,044.50"}},{"v":3044.5,"d":"$ 3,044.50"}]
[null,"CERTIFICADOS DE ASCENSO ENE - MAR 15",null,{"$f":"'CERTIFICADOS DE ASCENSO 2025'!C52","v":{"v":65.5,"d":"$ 65.50"}},{"$f":"'CERTIFICADOS DE ASCENSO 2025'!C53","v":{"v":1165,"d":"$ 1,165.00"}},{"$f":"D9+E9","v":{"v":1230.5,"d":"$ 1,230.50"}},{"v":1230.5,"d":"$ 1,230.50"}]
[null,"EVENTOS","III OPEN TODAS LAS CATEGORIAS ASOTKDP 16-11-24",{"$f":"'III OPEN 2024'!E58","v":{"v":4373,"d":"$ 4,373.00"}},{"$f":"'III OPEN 2024'!F58","v":{"v":8257,"d":"$ 8,257.00"}},{"$f":"D10+E10","v":{"v":12630,"d":"$ 12,630.00"}},{"$f":"'III OPEN 2024'!C92","v":{"v":8020.08,"d":"$ 8,020.08"}}]
[null,null,"CHEQUEO TÉCNICO EDADES 2025 08-12-2024",{"$f":"'CHEQUEO TÉCNICO EDADES 2025'!C45+'CHEQUEO TÉCNICO EDADES 2025'!C47","v":{"v":1049,"d":"$ 1,049.00"}},{"$f":"'CHEQUEO TÉCNICO EDADES 2025'!C46","v":{"v":441,"d":"$ 441.00"}},{"$f":"+D11+E11","v":{"v":1490,"d":"$ 1,490.00"}},{"$f":"'CHEQUEO TÉCNICO EDADES 2025'!C68","v":{"v":36,"d":"$ 36.00"}}]
[null,null,"CURSO ARBITRAJE 12-14 DIC 2024",{"$f":"'CURSO ARBITRAJE 12-14 DIC 2024'!C76","v":{"v":485,"d":"$ 485.00"}},{"$f":"'CURSO ARBITRAJE 12-14 DIC 2024'!C77","v":{"v":1380,"d":"$ 1,380.00"}},{"$f":"+D12+E12","v":{"v":1865,"d":"$ 1,865.00"}},{"$f":"'CURSO ARBITRAJE 12-14 DIC 2024'!C93","v":{"v":780,"d":"$ 780.00"}}]
[null,null,"CURSO DE ACREDITACIÓN ENTRENADORES DE 14 AL 19 DE ENERO",{"$f":"'ACREDITACIÓN ENTRENADORES 2025'!C453","v":{"v":2894,"d":"$ 2,894.00"}},{"$f":"'ACREDITACIÓN ENTRENADORES 2025'!C454","v":{"v":12875,"d":"$ 12,875.00"}},{"$f":"SUM(D13:E13)","v":{"v":15769,"d":"$ 15,769.00"}},{"$f":"'ACREDITACIÓN ENTRENADORES 2025'!C485","v":{"v":6945.1,"d":"$ 6,945.10"}}]
[null,null,"I SELECTIVO CADETES, JUNIOR Y JUVENIL 2025 16-02-2025",{"$f":"'I SELECTIVO CAD, JUN Y JUV'!C45+'I SELECTIVO CAD, JUN Y JUV'!C47+'I SELECTIVO CAD, JUN Y JUV'!C48","v":{"v":1145,"d":"$ 1,145.00"}},{"$f":"'I SELECTIVO CAD, JUN Y JUV'!C46","v":{"v":404,"d":"$ 404.00"}},{"$f":"SUM(D14:E14)","v":{"v":1549,"d":"$ 1,549.00"}},{"$f":"'I SELECTIVO CAD, JUN Y JUV'!C73","v":{"v":-75,"d":"$ (75.00)"}}]
[null,null,"I OPEN ASOTKD 2025, I SELECTIVO POOMSAE Y II SELECTIVO CADETES Y JUNIOR, I SELECTIVO INFANTIL A, B Y SUB 21",{"$f":"'I OPEN ASOTKD 2025 Y SELECTIVO'!C76+'I OPEN ASOTKD 2025 Y SELECTIVO'!C78","v":{"v":4577,"d":"$ 4,577.00"}},{"$f":"'I OPEN ASOTKD 2025 Y SELECTIVO'!C77","v":{"v":8226,"d":"$ 8,226.00"}},{"$f":"SUM(D15:E15)","v":{"v":12803,"d":"$ 12,803.00"}},{"$f":"'I OPEN ASOTKD 2025 Y SELECTIVO'!C117","v":{"v":2490.2999999999993,"d":"$ 2,490.30"}}]
[null,"CHIMBACALLE","MENSUALIDADES",0,{"v":6784.5,"d":"$ 6,784.50"},0,{"$f":"D16+E16","v":{"v":6784.5,"d":"$ 6,784.50"}}]
[null,"MULTAS","PAGO MULTA CLUB BLS",0,{"v":100,"d":"$ 100.00"},0,{"v":100,"d":"$ 100.00"}]
[null,null,"PAGO MULTA CLUB TKT",0,{"v":50,"d":"$ 50.00"},0,{"v":50,"d":"$ 50.00"}]
[null,"OTROS","PAGO SUPLETORIOS EVALUCAIÓN DE ACREDITACIÓN DE ENTRENADORES","CUENTA DAYANA FOLLECO",{"$f":"'PAGO DERECHO SEGUNDO EXAMEN ACR'!E80","v":{"v":340,"d":"$ 340.00"}},0,{"$f":"E19","v":{"v":340,"d":"$ 340.00"}}]
[{"$nulls":3},"CUENTA ASOTKD-P",{"$f":"'PAGO DERECHO SEGUNDO EXAMEN ACR'!E81","v":{"v":45,"d":"$ 45.00"}},0,{"$f":"E20","v":{"v":45,"d":"$ 45.00"}}]
[null,"TOTAL",{"$nulls":4},{"$f":"SUM(G4:G20)","v":{"v":52759.05,"d":"$ 52,759.05"}}]

{"sheet":"AFILIACIONES Y PERMISOS 2024","index":1,"n_rows":138,"n_cols":10,"rows_kept":138,"merged":[[8,0,9,0],[8,3,9,3],[8,4,9,4],[8,5,9,5],[8,6,9,6],[8,7,9,7],[8,8,9,8],[129,1,129,2]]}
{"$rows_empty":8}
["N°","CLUBES FILIALES","FUNCIONAMIENTO 2023","SALDOS PENDIENTES DESDE 30 DE SEPTIEMBRE 2023","N° COMPROBANTE/FECHA","P. FUNCIONAMIENTO","N° COMPROBANTE/FECHA","ESTADO","DEUDA"]
[null,"CLUB","REPRESENTANTE"]
[1,"Apolo","Mario Pinto",0,null,{"v":70,"d":"$ 70.00"},"BP. 34579953  13-11-2024","PAGADO",0]
[2,"Ares","Fernando Manosalvas",0,null,{"v":70,"d":"$ 70.00"},"BP. 69041936- 05-09-2024","PAGADO",0]
[3,"Atlas Club","Edgar Varela",{"v":20,"d":"$ 20.00"},"BP. 05-02-2024 - 199487930       ",{"v":70,"d":"$ 70.00"},"BP. 110392984 - 13-01-2025","PAGADO",0]
[4,"BaekJul BG","Jorge Proaño",0,null,"ANTERIOR $70","002312977 - 18-01-2024","PAGADO",0]
[5,"BaekJul BG (Sucursal)","Daniel Ayala",0,null,"ANTERIOR $50","BP. 160291895 - 22-01-2024","PAGADO",0]
[6,"Bas Panthers","Jonatan Bastidas",0,null,"ANTERIOR $100","COP.P.N. 5750- 23-04-2024/ B.P. 25633758 - 14-08-2024","PAGADO",0]
[7,"Bas Panthers Pintag (Sucursal)","Jonatan Bastidas",null,null,"ANTERIOR $50","BG. 0001655422 - 15-08-2024","PAGADO",0]
[8,"Borja Lions","Edgar Borja",0,null,"ANTERIOR $70","BP. 53210770 - 08-02-2024","PAGADO",0]
[9,"Blue Drangons","William Suntaxi",0,null,"ANTERIOR $200","BP. 17281887-26-07-2024","PAGADO",0]
[10,"Ciudad de Quito","Fernando Jaramillo",0,null,"ANTERIOR $70","34719163 - 16-01-2024","PAGADO",0]
[11,"Ciudad de Quito (Sucursal)","Adriana Obando",0,null,{"v":50,"d":"$ 50.00"},"BP. 105725396- 05-09-2024","PAGADO",0]
[12,"Condor","Juan Carlos Ramírez",0,null,"ANTERIOR $70",null,"CRUCE DEUDA",0]
[13,"Chen Huu","Pablo Cobos",0,null,"ANTERIOR $70","BP 29399075 15-03-2024","PAGADO",0]
[14,"Chonkwon","Luis Huaraca",0,null,0,null,"PENDIENTE",0,"EN PROCESO DE DESAFILIACIÓN POR DEUDA"]
[15,"Chung Song","Carlos Morocho",0,null,"ANTERIOR $70","BP. 8942157 06-02-2024","PAGADO",0]
[16,"Champions for live","Byron Berrones",0,null,{"v":200,"d":"$ 200.00"},"BP. 39643133- 06-09-2024","PAGADO",0]
[17,"Daigoro","Edison Pérez V.",0,null,"ANTERIOR $70","BP. 21042379-05-07-2024","PAGADO",0]
[18,"Daigoro Sucursal  Sector El Beaterio","Edison Pérez V.",0,null,"ANTERIOR $50","BP. 21042379-05-07-2024","PAGADO",0]
[19,"Debak TKD","Jimmy Bolaños",0,null,"ANTERIOR $146","PASO DEUDA 18-07-2024","PAGADO",0]
[20,"Debak TKD Colegio de Liga","Fredy Hidalgo",0,null,"ANTERIOR $50","PASO DEUDA 18-07-2024","PAGADO",0]
[21,"Deciap","Pablo Tayo",0,null,"ANTERIOR $70","SERVICIOS PROFESIONALES","CANJE",0]
[22,"Deciap Norte","Joel Mogollon",0,null,0,null,"PENDIENTE",{"v":50,"d":"$ 50.00"}]
[23,"Dojang Taekwondo Melo","Vinicio Melo",0,null,"ANTERIOR $70","73827343 - 16-01-2024","PAGADO",0]
[24,"Draco","Edison Rodríguez",0,null,"ANTERIOR $70","BP.55066275-8-08-2024","PAGADO",0]
[25,"Dragon Gym","Miguel Aguas",0,null,"ANTERIOR $70","BP.103149991-03-06-2024","PAGADO",0]
[26,"Dragon Lee Gym","Edgar Lema",0,null,"ANTERIOR  $70","INICIO AÑO 2024","PAGADO",0]
[27,"Ecuadcuba/ Black Panthers","Eddy Cajigal  Kindelan",0,null,{"v":70,"d":"$ 70.00"},"EFECTIVO 16-02-2025","PAGADO",0]
[28,"Ecuador ","Jorge Astudillo",0,null,"ANTERIOR $70","74095048 - 16-01-2024","PAGADO",0]
[29,"Equilibrio","Juan Valencia",0,null,"ANTERIOR $70","690260924 - 12-01-2024","PAGADO",0]
[30,"ESPE","Eduardo Loachamín",0,null,"ANTERIOR $70","SERVICIOS PROFESIONALES","PAGADO",0]
[31,"ESMIL - Eloy Alfaro","Raúl Aucancela",0,null,"ANTERIOR","CONVENIO INTERINSTITUCIONAL","CANJE",0]
[32,"Farang","Mesias Rojas",0,null,"ANTERIOR $70","BP. 191879288 - 19-08-2024","PAGADO",0]
[33,"Fitt kwon do","Galo Garzón ",0,null,{"v":70,"d":"$ 70.00"},"BP. 36797612-18-09-2024","PAGADO",0]
[34,"First Class Calderon","Lenin Plazarte",0,null,{"v":70,"d":"$ 70.00"},"B.P. 82900555-28-10-2024/ PA. 6305683 - 15-01-2025","PAGADO",0]
[35,"Furia Negra","Franklin Caiza",0,null,{"v":70,"d":"$ 70.00"},"BP. 46232939 - 05-09-2024","PAGADO",0]
[36,"Grand Master ","César Tayo",0,null,{"v":70,"d":"$ 70.00"},"PAGO POR USO DE PÁGINA DE EVENTOS","PAGADO",0]
[37,"Goyang - Ideul","Luis Elias Pisuña",null,null,"ANTERIOR $270","P.O.00077-11-04-24","PAGADO",0]
[38,"Han Su","Mauricio Valladares",0,null,"ANTERIOR $70","PAGO POR DIPLOMAS","PAGADO",0]
[39,"Himchari Dojang","Claudia Cárdenas",0,null,"ANTERIOR $70","BP. 19157477 - 28-08-2024","PAGADO",0]
[40,"Huang Top Gym","Guido Mejia",0,null,{"v":70,"d":"$ 70.00"},"Pro.155311020900-22-11-24","PAGADO",0]
[41,"Ilyo MP","Miguel Parra",0,null,{"v":75,"d":"$ 75.00"},"Pro.155311020900-22-11-24","PAGADO",0]
[42,"Ji Do Kwan","David Del Castillo",0,null,"ANTERIOR $70","Prod.1219880209-07-06-24","PAGADO",0]
[43,"Joseon Legacy","Fernando Moya",0,null,"ANTERIOR $70","Pago en curso de entrenadores","PAGADO",0]
[44,"JR Sport","Juan Carlos Ramírez",0,null,"ANTERIOR $70","BG 9916798 15-03-2024","PAGADO",0]
[45,"Juventus","Jhony Pavón",0,null,{"v":70,"d":"$ 70.00"},"BG. 0003214632-05-09-2024","PAGADO",0]
[46,"Jerathel","Samantha Mogollon",0,null,{"v":50,"d":"$ 50.00"},"EN DB.P.125575249 - 28-10-2024","PAGADO",0]
[47,"Ko América","Miguel Angél Pavón",0,null,"ANTERIOR $70","PASO SERVICIO DE INTERNET FIJO XTRIM TV CABLE","PAGADO",0]
[48,"Ko América Caupicho","Bryan Chalcualan",0,null,"ANTERIOR $50","PASO SERVICIO DE INTERNET FIJO XTRIM TV CABLE","PAGADO",0]
[49,"Ko América Santo Tomas","Bryan Chalcualan",null,null,"ANTERIOR $50","BP. 51813288- 12-07-2024","PAGADO",0]
[50,"Ko América Dragon de Fuego","Luis Sandoval",0,null,{"v":50,"d":"$ 50.00"},"BP. 26570994-02-10-2024","PAGADO",0]
[51,"Korean Dragon","Fabián Moreno",0,null,"ANTERIOR $70","BP.20228234 - 23-07-2024","PAGADO",0]
[52,"Koryo","Guillermo Puga - Sharon López",0,null,"ANTERIOR $70","B.P. 99611502- 16-05-24","PAGADO",0]
[53,"Koryo Sucursal","Edwin Delgado",0,null,"ANTERIOR $50","B.P. 99611502- 16-05-24","PAGADO",0]
[54,"Koryo Sucursal","Dayana Folleco",0,null,"ANTERIOR $50","SERVICIOS PROFESIONALES ","PAGADO",0]
[55,"Kukkiwon","David Chicaiza",0,null,"ANTERIOR $70","BP. 186207888 5-07-2024","PAGADO",0]
[56,"Kumgan Dul","Fabián García",0,null,{"v":70,"d":"$ 70.00"},"BP. 16642518-30-12-2024","PAGADO",0]
[57,"Kyorugui Gym","Vinicio Cardona",0,null,{"v":45,"d":"$ 45.00"},"2024-09-06","PAGADO",0]
[58,"León","Romel  Pilaquinga",0,null,{"v":30,"d":"$ 30.00"},"BP. 61286404- 05-09-2024","PAGADO",0]
[59,"Liga Deportiva Cantonal Mejía","Fernando Manosalvas",null,null,"ANTERIOR $70","BP. 6894312 10-07-2024","PAGADO",0]
[60,"Lithe body","Norma Ortíz ",{"v":70,"d":"$ 70.00"},"B.P. 84431747- 24-10-2023","ANTERIOR $70","BP. 41487117- 20-02-2024","PAGADO",0]
[61,"Lobos","Cristian Flores",{"v":70,"d":"$ 70.00"},"BP. 16933896-29-02-2024",{"v":70,"d":"$ 70.00"},"BP. 10046769 - 15-01-2025","PAGADO",0]
[62,"Los Pumas","Galo Gavilanez",0,null,{"v":70,"d":"$ 70.00"},"BP. 46146086-05-09-2024","PAGADO",0]
[63,"Master Home","Marlon Lema",0,null,{"v":70,"d":"$ 70.00"},"DEPÓSITO 12-12-2024","PAGADO",0]
[64,"Marcial Club Granda","Luis Granda",0,null,"ANTERIOR $70","19254425 - 12-01-2024","PAGADO",0]
[65,"Mercenarios","Luis Cano",0,null,"ANTERIOR $70","OPEN DE LIMA","CANJE DEUDA",0]
[66,"Mikido","Daniel Guerra",null,null,"ANTERIOR $270","B.P. 93929997-26-03-2024","PAGADO",0]
[67,"Millenium","Jean Galora",0,null,"ANTERIOR $70","42113-16-05-24","PAGADO",0]
[68,"Michay","Luisa Vega",{"v":35,"d":"$ 35.00"},"B.P. 20092834- 05-03-2024 CEN ","ANTERIOR $70","BP. 20092834- 05-03-2024","PAGADO",0]
[69,"Minotaurus","Marco Duchi",{"v":70,"d":"$ 70.00"},"B.P 115490149-11-12-2023","ANTERIOR $70","71140294 - 17-01-2024","PAGADO",0]
[70,"Mit-TKD","Mellany Inasunta",0,null,"ANTERIOR $70","92260917 - 04-01-2024","PAGADO",0]
[71,"Mit -TKD Sucursal","Jared Vargas",0,null,"ANTERIOR $50","47864538 - 16-01-2024","PAGADO",0]
[72,"Paladins","Jeann Paladines",0,null,{"v":70,"d":"$ 70.00"},"BP. 234822309-10-06-2024","PAGADO",0]
[73,"Pandademon","Andrés Herrera",{"v":70,"d":"$ 70.00"},"PRO.840804020900.05-02-2024 ",{"v":70,"d":"$ 70.00"},"BP. 61932362- 13-01-2024","PAGADO",0]
[74,"Pionero Fortis","Xavier Moreira Fortis",0,null,{"v":70,"d":"$ 70.00"},"B.P. 3585973-13-12-20","PAGADO",0]
[75,"Pionero Mejía","Luís Burbano",{"v":70,"d":"$ 70.00"},"comp 27400959-6-2-24                 ",{"v":70,"d":"$ 70.00"},"BP. 38675762- 13-01-2025","PAGADO",0]
[76,"Pyongyang","Luisa Vega",0,null,"ANTERIOR $70","BP. 46309319 - 24-01-2024","PAGADO",0]
[77,"Raig de llum","Fernando Ruiz",0,null,"ANTERIOR $70","BP.29220414-22-05-2024","PAGADO",0]
[78,"Tanaka Red","Carlos Estrella",0,null,"ANTERIOR $70","PRO.190784020900-23-01-2024","PAGADO",0]
[79,"Renacer","Milton Ramos",0,null,"ANTERIOR $70","2304516 - 12-01-2024","PAGADO",0]
[80,"Rojas Iron First","Jorge Rojas",0,null,{"v":70,"d":"$ 70.00"},"45438497- 12-01-2024","PAGADO",0]
[81,"S.D.Central","Carlos Reinoso",0,null,"ANTERIOR $70","BP. 7707848 - 22-01-2024","PAGADO",0]
[82,"San Francisco Tigres","Carlos Mejía",0,null,{"v":70,"d":"$ 70.00"},"BP. 27638772 - 05-11-2024","PAGADO",0]
[83,"San Sebastián","Raúl Tipán",0,null,0,"PASO DEUDA Y 1 DEP A JUEGOS","PAGADO",0]
[84,"Scorpius","Dario Flores",0,null,{"v":70,"d":"$ 70.00"},"Prd.389542020900-05-09-24","PAGADO",0]
[85,"Seúl","Galo Garzón",0,null,"ANTERIOR $65","1039095 - 27-12-2023 (1 jue N)","PAGADO",0]
[86,"Seúl Capelo (Sucursal)","Fredy Castillo",0,null,{"v":50,"d":"$ 50.00"},"BP. 44842339- 05-09-2024","PAGADO",0]
[87,"Seúl Carapungo (Sucursal)","José Donoso",0,null,"ANTERIOR $50","B.G.2285212-2-04-24","PAGADO",0]
[88,"Seúl Yeong-Gu Carcelen","Brusby Muñoz",0,null,"ANTERIOR $50","BP. 24853537 - 21-05-2024","PAGADO",0]
[89,"Seúl Gedeon (Sucrusal)","José Luís Palacios",0,null,"ANTERIOR $50","BG. 0009916524 - 18-03-2024","PAGADO",0]
[90,"Seúl Chung UI (sucursal)","Juan Manuel Villacres",0,null,"ANTERIOR $50","BP. 11085488 - 22-03-2024","PAGADO",0]
[91,"Seúl Vale Todo Capapungo","Angél Vayas",0,null,{"v":50,"d":"$ 50.00"},"BP. 93202077- 05-09-2024","PAGADO",0]
[92,"Seúl La Salle","Angelica Guerrero",0,null,"ANTERIOR $50","002-00015-22-05-2024","PAGADO",0]
[93,"Shogun","Carlos Vélez",0,null,"ANTERIOR $70","BP. 14359822 - 21-03-2024","PAGADO",0]
[94,"Simjang Team Club de TKD","Marco Mogollon",0,null,"ANTERIOR $270","03-01-2024 - 20218020","PAGADO",0]
[95,"Suryun","Edison Gallardo",0,null,"ANTERIOR $70","CANJE Y $ 20 BP. 138566834 19-08-2024","PAGADO",0]
[96,"Tae  Baek  Junior","Edwin  Arteaga Jr.",0,null,{"v":70,"d":"$ 70.00"},"BP. 141222211-11-11-2024","PAGADO",0]
[97,"Tae Baek Junior Sucursal Solanda","Edwin  Arteaga Jr.",0,null,0,null,"PENDIENTE",{"v":50,"d":"$ 50.00"}]
[98,"Tae Baek","Edwin Arteaga",{"v":70,"d":"$ 70.00"},"B.P. 38952579 -13-12-2023        ",{"v":70,"d":"$ 70.00"},"BP. 51380759- 05-09-2024","PAGADO",0]
[99,"Tae Kings","Jorge Astudillo S.",0,null,{"v":70,"d":"$ 70.00"},"Pa. 4290202-14-10-2024","PAGADO",0]
[100,"Tae Sho Ku","Marcelo Ochoa",0,null,"ANTERIOR $70","BP. 29348779-26-06-2024","PAGADO",0]
[101,"Tae Sho Ku","Gissela Estrella",0,null,"ANTERIOR $50","B.P. 67213266-17-05-24","PAGADO",0]
[102,"TaeDo","Vicente Lazcano",0,null,{"v":70,"d":"$ 70.00"},"BP. 111358254- 05-09-2024","PAGADO",0]
[103,"Taekwondo Trainig Center","Paúl Orellana",0,null,{"v":70,"d":"$ 70.00"},"BG. 305852 - 12-03-2025","PAGADO",0]
[104,"Taekwondo Jitae","Emperatriz Quinga",0,null,"ANTERIOR $70","92326958 - 17-01-2024","PAGADO",0]
[105,"Taekwondo Jucaro","Danilo Xavier Peréz",0,null,"ANTERIOR $70","CANJE S. PROFESIONALES 03-02-2024 ($245)","PAGADO",0]
[106,"Tae Woong","Patricia Tuqueres",{"v":100,"d":"$ 100.00"},"B.P.27841022 - 19-10-2023       ","ANTERIOR $70","DEPÓSITO","PAGADO",0]
[107,"Team Tauro Taekwondo","José Chiriboga",0,null,"ANTERIOR $70","982779 - 19-01-2024","PENDIENTE",{"v":150,"d":"$ 150.00"}]
[108,"Team Vencedores","Victor Hugo Quishpe",0,null,{"v":70,"d":"$ 70.00"},"BP. 52426968 - 14-10-2024","PAGADO",0]
[109,"Tekken","Gustavo López",0,null,"ANTERIOR $70","OFI. 3294433- 04-02-2024","PAGADO",0]
[110,"Total Kombat","Raúl Aucancela",0,null,"ANTERIOR $70","SALDO A FAVOR POR PAGO DE U. H. ","PAGADO",0]
[111,"Total Kombat Rhinos Sucursal","Gustavo Llamuca",0,null,"ANTERIOR $50","SALDO A FAVOR POR PAGO DE U. H. ","PAGADO",0]
[112,"U San Francisco  USFQ","Carlos Reinoso",0,null,"ANTERIOR $70","PASO DEUDA","PAGADO",0]
[113,"Universal","Jorge Sisalema",0,null,"ANTERIOR $70","EFECTIVO","PAGADO",0]
[114,"Universidad Central (CAMU)","Anthony Rendón",0,null,{"v":70,"d":"$ 70.00"},"BP. 209766626-18-09-2024","PAGADO",0]
[115,"Universidad Hemisferios","Raúl Aucancela",0,null,"ANTERIOR $267,3","BP.318788754-18/3/2024","PAGADO",0]
[116,"Valle","Jorge Portilla",null,null,0,null,"PENDIENTE",0,"EN PROCESO DE DESAFILIACIÓN POR DEUDA"]
[117,"Venom","Eddy Cajigal  K.",0,null,{"v":30,"d":"$ 30.00"},"PRO.157300020900-1-10-24","PAGADO",0]
[118,"Vill Gym","Hernán Villacis",0,null,"ANTERIOR $70","BP. 7707848 - 22-01-2024","PAGADO",0]
[119,"Yong Tiger","Wilson Rodríguez",0,null,{"v":70,"d":"$ 70.00"},"DESCUENTO EN EVENTOS","PAGADO",0]
[null,"TOTAL PAGOS SALDOS 2024",null,{"$f":"SUM(D11:D129)","v":{"v":575,"d":"$ 575.00"}},null,{"$f":"SUM(F11:F129)","v":{"v":2660,"d":"$ 2,660.00"}},null,null,{"$f":"SUM(I11:I129)","v":{"v":250,"d":"$ 250.00"}},"POR COBRAR"]
[]
[]
[null,"Se descuenta 5 USD por cada alumno que participe en Juegos Nacionales"]
[null,"AFILIACIÓN NUEVO CLUB",null,200]
[null,"PERSMISO ANUAL DE FUNCIONAMIENTO",null,70]
[null,"REAFILIACIÓN",null,100]
[]
[null,"ACTUALIZADO HASTA EL 15-03-2025"]

{"sheet":"AFILIACIONES Y PERMISOS 2025","index":2,"n_rows":143,"n_cols":10,"rows_kept":143,"merged":[[8,0,9,0],[8,3,9,3],[8,4,9,4],[8,5,9,5],[8,6,9,6],[8,7,9,7],[8,8,9,8],[134,1,134,2]]}
{"$rows_empty":8}
["N°","CLUBES FILIALES","FUNCIONAMIENTO 2023","SALDOS PENDIENTES DESDE 30 DE SEPTIEMBRE 2023","N° COMPROBANTE/FECHA","P. FUNCIONAMIENTO","N° COMPROBANTE/FECHA","ESTADO","DEUDA"]
[null,"CLUB","REPRESENTANTE"]
[1,"Apolo","Mario Pinto",0,null,0,null,"PENDIENTE",{"v":70,"d":"$ 70.00"}]
[2,"Ares","Fernando Manosalvas",0,null,0,null,"PENDIENTE",{"v":70,"d":"$ 70.00"}]
[3,"Atlas Club","Edgar Varela",{"v":20,"d":"$ 20.00"},"BP. 05-02-2024 - 199487930       ",0,null,"PENDIENTE",{"v":70,"d":"$ 70.00"}]
[4,"BaekJul BG","Jorge Proaño",0,null,{"v":70,"d":"$ 70.00"},"Pap. 3528183 - 16-01-2025","PAGADO",0]
[5,"BaekJul Team AyalaZ (Sucursal)","Daniel Ayala",0,null,{"v":50,"d":"$ 50.00"},"BP.13802498 - 14-01-2024 ","PAGADO",0]
[6,"BaekJul Team Fernández (Sucursal)","Freddy Fernández",null,null,{"v":50,"d":"$ 50.00"},"BP. 67130502- 08-10-2024","PAGADO",0,"NUEVO"]
[7,"Bas Panthers","Jonatan Bastidas",0,null,0,null,"PENDIENTE",{"v":70,"d":"$ 70.00"}]
[8,"Bas Panthers Pintag (Sucursal)","Jonatan Bastidas",null,null,0,null,"PENDIENTE",{"v":50,"d":"$ 50.00"}]
[9,"Borja Lions","Edgar Borja",0,null,0,null,"PENDIENTE",{"v":70,"d":"$ 70.00"}]
[10,"Blue Drangons","William Suntaxi",0,null,0,null,"PENDIENTE",{"v":70,"d":"$ 70.00"}]
[11,"Ciudad de Quito","Fernando Jaramillo",0,null,0,null,"PENDIENTE",{"v":70,"d":"$ 70.00"}]
[12,"Ciudad de Quito (Sucursal)","Adriana Obando",0,null,0,null,"PENDIENTE",{"v":50,"d":"$ 50.00"}]
[13,"Condor","Juan Carlos Ramírez",0,null,0,null,"PENDIENTE",{"v":70,"d":"$ 70.00"}]
[14,"Chen Huu","Pablo Cobos",0,null,{"v":70,"d":"$ 70.00"},"BP. 165476447 - 24-02-2025","PAGADO",0]
[16,"Chung Song","Carlos Morocho",0,null,0,null,"PENDIENTE",{"v":70,"d":"$ 70.00"}]
[17,"Champions for live","Byron Berrones",0,null,{"v":65,"d":"$ 65.00"},"BP.56940902 -04-02 2025 1 DEPORTISTA EN JJ. NN.","PAGADO",0]
[18,"Daigoro","Edison Pérez V.",0,null,0,null,"PENDIENTE",{"v":70,"d":"$ 70.00"}]
[19,"Daigoro Sucursal  Sector El Beaterio","Edison Pérez V.",0,null,0,null,"PENDIENTE",{"v":50,"d":"$ 50.00"}]
[20,"Debak TKD","Jimmy Bolaños",0,null,0,null,"PENDIENTE",{"v":70,"d":"$ 70.00"}]
[21,"Debak TKD Colegio de Liga","Adrián Lara",0,null,0,null,"PENDIENTE",{"v":50,"d":"$ 50.00"}]
[22,"Debak TKD Carcelén Bajo (Sucursal)","Jared Vargas",null,null,{"v":50,"d":"$ 50.00"},"BP. 61173349 - 07-03-2025","PAGADO",{"v":50,"d":"$ 50.00"},"NUEVO"]
[23,"Deciap","Pablo Tayo",0,null,0,null,"PAGADO",{"v":70,"d":"$ 70.00"}]
[24,"Deciap Norte","Joel Mogollon",0,null,0,null,"PENDIENTE",{"v":50,"d":"$ 50.00"}]
[25,"Dojang Taekwondo Melo","Vinicio Melo",0,null,{"v":70,"d":"$ 70.00"},"BP. 22714106 - 06-03-2025","PAGADO",0]
[26,"Draco","Edison Rodríguez",0,null,0,null,"PENDIENTE",{"v":70,"d":"$ 70.00"}]
[27,"Dragon Gym","Miguel Aguas",0,null,0,null,"PENDIENTE",{"v":70,"d":"$ 70.00"}]
[28,"Dragon Lee Gym","Edgar Lema",0,null,{"v":70,"d":"$ 70.00"},"BP. 48960200- 16-01-2025","PAGADO",0]
[29,"Ecuadcuba/ Black Panthers","Eddy Cajigal  Kindelan",0,null,0,null,"PENDIENTE",{"v":70,"d":"$ 70.00"}]
[30,"Ecuador ","Jorge Astudillo",0,null,{"v":70,"d":"$ 70.00"},"BP. 41631917- 08-01-2025","PAGADO",0]
[31,"Equilibrio","Juan Valencia",0,null,{"v":70,"d":"$ 70.00"},"BR.826500- 27-01-2025","PAGADO",0]
[32,"ESPE","Eduardo Loachamín",0,null,0,null,"PENDIENTE",{"v":70,"d":"$ 70.00"}]
[33,"ESMIL - Eloy Alfaro","Raúl Aucancela",0,null,0,null,"PENDIENTE",{"v":70,"d":"$ 70.00"}]
[34,"Farang","Mesias Rojas",0,null,0,null,"PENDIENTE",{"v":70,"d":"$ 70.00"}]
[35,"Fitt kwon do","Galo Garzón ",0,null,0,null,"PENDIENTE",{"v":70,"d":"$ 70.00"}]
[36,"First Class Calderon","Lenin Plazarte",0,null,0,null,"PENDIENTE",{"v":70,"d":"$ 70.00"}]
[37,"Furia Negra","Franklin Caiza",0,null,0,null,"PENDIENTE",{"v":70,"d":"$ 70.00"}]
[38,"Grand Master ","César Tayo",0,null,0,"SE ACUERDA COMPROMISO DE PAGO POR APOYO EN EVENTOS","PENDIENTE",{"v":70,"d":"$ 70.00"}]
[39,"Goyang - Ideul","Luis Elias Pisuña",null,null,0,null,"PENDIENTE",{"v":70,"d":"$ 70.00"}]
[40,"Han Su","Mauricio Valladares",0,null,0,"PAGO POR DIPLOMAS","PENDIENTE",{"v":70,"d":"$ 70.00"}]
[41,"Han Kum Do","Nicole Tapia",null,null,{"v":70,"d":"$ 70.00"},"BG. 0000350660-13-01-2025","PENDIENTE",{"v":200,"d":"$ 200.00"},"NUEVO"]
[42,"Himchari Dojang","Claudia Cárdenas",0,null,0,null,"PENDIENTE",{"v":70,"d":"$ 70.00"}]
[43,"Huang Top Gym","Guido Mejia",0,null,0,null,"PENDIENTE",{"v":70,"d":"$ 70.00"}]
[44,"Ilyo MP","Miguel Parra",0,null,0,null,"PENDIENTE",{"v":70,"d":"$ 70.00"}]
[45,"Ji Do Kwan","David Del Castillo",0,null,0,null,"PENDIENTE",{"v":70,"d":"$ 70.00"}]
[46,"Joseon Legacy","Fernando Moya",0,null,0,null,"PENDIENTE",{"v":70,"d":"$ 70.00"}]
[47,"JR Sport","Juan Carlos Ramírez",0,null,0,null,"PENDIENTE",{"v":70,"d":"$ 70.00"}]
[48,"Juventus","Jhony Pavón",0,null,0,null,"PENDIENTE",{"v":70,"d":"$ 70.00"}]
[49,"Jerathel","Samantha Mogollon",0,null,{"v":70,"d":"$ 70.00"},"BP. 12782374 - 28-01-2024","PAGADO",0]
[50,"Ko América","Miguel Angél Pavón",0,null,{"v":65,"d":"$ 65.00"},"BP.13888302-07-01-2024 1 DEPORTISTA EN JJ. NN.","PAGADO",0]
[51,"Ko América Caupicho","Bryan Chalcualan",0,null,0,null,"PENDIENTE",{"v":50,"d":"$ 50.00"}]
[52,"Ko América Santo Tomas","Bryan Chalcualan",null,null,0,null,"PENDIENTE",{"v":50,"d":"$ 50.00"}]
[53,"Ko América Dragon de Fuego","Luis Sandoval",0,null,0,null,"PENDIENTE",{"v":50,"d":"$ 50.00"}]
[54,"Korean Dragon","Fabián Moreno",0,null,0,null,"PENDIENTE",{"v":70,"d":"$ 70.00"}]
[55,"Koryo","Guillermo Puga - Sharon López",0,null,0,null,"PENDIENTE",{"v":70,"d":"$ 70.00"}]
[56,"Koryo Sucursal","Edwin Delgado",0,null,0,null,"PENDIENTE",{"v":50,"d":"$ 50.00"}]
[57,"Koryo Sucursal","Dayana Folleco",0,null,0,null,"PENDIENTE",{"v":50,"d":"$ 50.00"}]
[58,"Kukkiwon","David Chicaiza",0,null,0,null,"PENDIENTE",{"v":70,"d":"$ 70.00"}]
[59,"Kumgan Dul","Fabián García",0,null,0,null,"PENDIENTE",{"v":70,"d":"$ 70.00"}]
[60,"Kyorugui Gym","Vinicio Cardona",0,null,0,null,"PENDIENTE",0]
[61,"León","Romel  Pilaquinga",0,null,0,null,"PENDIENTE",{"v":70,"d":"$ 70.00"}]
[62,"León (Sucursal Norte)","Ian Catota",null,null,{"v":50,"d":"$ 50.00"},"BP. 15791114 - 14-01-2024","PAGADO",0,"NUEVO"]
[63,"Liga Deportiva Cantonal Mejía","Vladimir Viana",null,null,0,null,"PENDIENTE",{"v":70,"d":"$ 70.00"}]
[64,"Lithe body","Norma Ortíz ",{"v":70,"d":"$ 70.00"},"B.P. 84431747- 24-10-2023",0,null,"PENDIENTE",0]
[65,"Lobos","Cristian Flores",{"v":70,"d":"$ 70.00"},"BP. 16933896-29-02-2024",0,null,"PENDIENTE",{"v":70,"d":"$ 70.00"}]
[66,"Los Pumas","Galo Gavilanez",0,null,0,null,"PENDIENTE",{"v":70,"d":"$ 70.00"}]
[67,"Master Home","Marlon Lema",0,null,0,null,"PENDIENTE",{"v":70,"d":"$ 70.00"}]
[68,"Marcial Club Granda","Luis Granda",0,null,0,null,"PENDIENTE",{"v":70,"d":"$ 70.00"}]
[69,"Mercenarios","Luis Cano",0,null,0,null,"PENDIENTE",{"v":70,"d":"$ 70.00"}]
[70,"Mikido","Daniel Guerra",null,null,{"v":70,"d":"$ 70.00"},"BP. 32299486 - 06-02-2025","PAGADO",0]
[71,"Millenium","Jean Galora",0,null,0,null,"PENDIENTE",{"v":70,"d":"$ 70.00"}]
[72,"Michay","Luisa Vega",{"v":35,"d":"$ 35.00"},"B.P. 20092834- 05-03-2024 CEN ",{"v":70,"d":"$ 70.00"},"BP. 88911303 - 24-02-2025","PAGADO",0]
[73,"Minotaurus","Marco Duchi",{"v":70,"d":"$ 70.00"},"B.P 115490149-11-12-2023",{"v":70,"d":"$ 70.00"},"BP. 7688068 - 11-03-2025","PAGADO",0]
[74,"Mit-TKD","Mellany Inasunta",0,null,{"v":70,"d":"$ 70.00"},"BP. 83102853 - 05-03-2025","PAGADO",0]
[75,"Paladins","Jeann Paladines",0,null,0,null,"PENDIENTE",{"v":70,"d":"$ 70.00"}]
[76,"Pandademon","Andrés Herrera",{"v":70,"d":"$ 70.00"},"PRO.840804020900.05-02-2024 ",0,null,"PENDIENTE",{"v":70,"d":"$ 70.00"}]
[77,"Pionero Fortis","Xavier Moreira Fortis",0,null,0,null,"PENDIENTE",{"v":70,"d":"$ 70.00"}]
[78,"Pionero Mejía","Luís Burbano",{"v":70,"d":"$ 70.00"},"comp 27400959-6-2-24                 ",{"v":70,"d":"$ 70.00"},"BG. 0000519175-06-02-2025","PAGADO",0]
[79,"Pyongyang","Luisa Vega",0,null,{"v":70,"d":"$ 70.00"},"BP. 88911303 - 24-02-2025","PAGADO",0]
[80,"Raig de llum","Fernando Ruiz",0,null,0,null,"PENDIENTE",{"v":70,"d":"$ 70.00"}]
[81,"Tanaka Red","Carlos Estrella",0,null,{"v":70,"d":"$ 70.00"},"PRO. 675070 - 15-01-2025 ","PAGADO",0]
[82,"Renacer","Milton Ramos",0,null,{"v":70,"d":"$ 70.00"},"PA. 8714977 - 25-02-2025","PAGADO",0]
[83,"Ryong Tae","Diego Merino",null,null,{"v":170,"d":"$ 170.00"},"PA. 7302739- 14-11-2024 / PA.5069396 - 27-01-2025","PENDIENTE",{"v":100,"d":"$ 100.00"},"NUEVO"]
[84,"Rojas Iron First","Jorge Rojas",0,null,0,null,"PENDIENTE",{"v":70,"d":"$ 70.00"}]
[85,"S. D. Central","Carlos Reinoso",0,null,0,null,"PENDIENTE",{"v":70,"d":"$ 70.00"}]
[86,"S. D. Central Carapungo (Sucursal)","Guillermo Morán",null,null,{"v":50,"d":"$ 50.00"},"BP. 155411989 - 11-03-2025","PAGADO",0]
[87,"San Francisco Tigres","Carlos Mejía",0,null,0,null,"PENDIENTE",{"v":70,"d":"$ 70.00"}]
[88,"San Sebastián","Raúl Tipán",0,null,{"v":60,"d":"$ 60.00"},"BP.110817481 -10-03-2025 2 DEPORTISTAs EN JJ. NN.","PAGADO",0]
[89,"Scorpius","Dario Flores",0,null,0,null,"PENDIENTE",{"v":70,"d":"$ 70.00"}]
[90,"Seúl","Galo Garzón",0,null,0,null,"PENDIENTE",{"v":70,"d":"$ 70.00"}]
[91,"Seúl Capelo (Sucursal)","Fredy Castillo",0,null,0,null,"PENDIENTE",{"v":50,"d":"$ 50.00"}]
[92,"Seúl Carapungo (Sucursal)","José Donoso",0,null,0,null,"PENDIENTE",{"v":50,"d":"$ 50.00"}]
[93,"Seúl Yeong-Gu Carcelen","Brusby Muñoz",0,null,0,null,"PENDIENTE",{"v":50,"d":"$ 50.00"}]
[94,"Seúl Gedeon (Sucrusal)","José Luís Palacios",0,null,0,null,"PENDIENTE",{"v":50,"d":"$ 50.00"}]
[95,"Seúl Chung UI (sucursal)","Juan Manuel Villacres",0,null,0,null,"PENDIENTE",{"v":50,"d":"$ 50.00"}]
[96,"Seúl Vale Todo Capapungo","Angél Vayas",0,null,0,null,"PENDIENTE",{"v":50,"d":"$ 50.00"}]
[97,"Seúl La Salle","Angelica Guerrero",0,null,0,null,"PENDIENTE",{"v":50,"d":"$ 50.00"}]
[98,"Shogun","Carlos Vélez",0,null,{"v":70,"d":"$ 70.00"},"BP. 75401887 - 17-02-2025","PAGADO",0]
[99,"Simjang Team Club de TKD","Marco Mogollon",0,null,{"v":70,"d":"$ 70.00"},"BP. 12570316 - 28-01-2025","PAGADO",0]
[100,"Suryun","Edison Gallardo",0,null,0,null,"PENDIENTE",{"v":70,"d":"$ 70.00"}]
[101,"Tae  Baek  Junior","Edwin  Arteaga Jr.",0,null,0,null,"PENDIENTE",{"v":70,"d":"$ 70.00"}]
[102,"Tae Baek Junior Sucursal Solanda","Edwin  Arteaga Jr.",0,null,0,null,"PENDIENTE",{"v":50,"d":"$ 50.00"}]
[103,"Tae Baek","Edwin Arteaga",{"v":70,"d":"$ 70.00"},"B.P. 38952579 -13-12-2023        ",{"v":70,"d":"$ 70.00"},"BP. 2670551 - 28-01-2025","PAGADO",0]
[104,"Tae Kings","Jorge Astudillo S.",0,null,0,null,"PENDIENTE",{"v":70,"d":"$ 70.00"}]
[105,"Tae Sho Ku","Marcelo Ochoa",0,null,0,null,"PENDIENTE",{"v":70,"d":"$ 70.00"}]
[106,"Tae Sho Ku Team Valle (Sucursal)","Gissela Estrella",0,null,0,null,"PENDIENTE",{"v":50,"d":"$ 50.00"}]
[107,"TaeDo","Vicente Lazcano",0,null,0,null,"PENDIENTE",{"v":70,"d":"$ 70.00"}]
[108,"MoodukkwanTrainig Center","Paúl Orellana",0,null,{"v":70,"d":"$ 70.00"},"BG. 305852 - 12-03-2025","PAGADO",0]
[109,"Taekwondo Jitae","Emperatriz Quinga",0,null,0,null,"PENDIENTE",{"v":70,"d":"$ 70.00"}]
[110,"Taekwondo Jucaro","Danilo Xavier Peréz",0,null,0,null,"PENDIENTE",{"v":70,"d":"$ 70.00"}]
[111,"Tae Woong","Patricia Tuqueres",{"v":100,"d":"$ 100.00"},"B.P.27841022 - 19-10-2023       ",0,null,"PENDIENTE",{"v":70,"d":"$ 70.00"}]
[112,"Team Tauro Taekwondo","José Chiriboga",0,null,0,null,"PENDIENTE",{"v":70,"d":"$ 70.00"}]
[113,"Team Vencedores","Victor Hugo Quishpe",0,null,0,null,"PENDIENTE",{"v":70,"d":"$ 70.00"}]
[114,"Tekken","Gustavo López",0,null,{"v":70,"d":"$ 70.00"},"PA. 7152417 - 13-01-2025","PAGADO",0]
[115,"Total Kombat","Raúl Aucancela",0,null,0,null,"PENDIENTE",{"v":70,"d":"$ 70.00"}]
[116,"Total Kombat Rhinos Sucursal","Gustavo Llamuca",0,null,0,null,"PENDIENTE",{"v":50,"d":"$ 50.00"}]
[117,"Total Kombat Cobra Kai","Raúl Aucancela",null,null,{"v":50,"d":"$ 50.00"},"VERIFICAR FORMA DE PAGO","PAGADO",0,"NUEVO"]
[118,"U. San Francisco  USFQ","Carlos Reinoso",0,null,0,null,"PENDIENTE",{"v":70,"d":"$ 70.00"}]
[119,"Universal","Jorge Sisalema",0,null,{"v":70,"d":"$ 70.00"},"PA. 3309797 - 27-02-2025","PAGADO",0]
[120,"Universidad Central (CAMU)","Anthony Rendón",0,null,0,null,"PENDIENTE",{"v":70,"d":"$ 70.00"}]
[121,"Universidad Hemisferios","Raúl Aucancela",0,null,0,null,"PENDIENTE",{"v":70,"d":"$ 70.00"}]
[122,"Universidad UTE","Adriana Obando",null,null,{"v":262.57,"d":"$ 262.57"},"BP. 11052417 - 28-01-2025","PAGADO",0]
[124,"Venom","Eddy Cajigal  K.",0,null,0,null,"PENDIENTE",{"v":70,"d":"$ 70.00"}]
[125,"Vill Gym","Hernán Villacis",0,null,0,null,"PENDIENTE",0]
[126,"Yong Tiger","Wilson Rodríguez",0,null,0,null,"PENDIENTE",{"v":70,"d":"$ 70.00"}]
[null,"TOTAL PAGOS 2025",null,{"$f":"SUM(D11:D134)","v":{"v":575,"d":"$ 575.00"}},null,{"$f":"SUM(F11:F134)","v":{"v":2462.57,"d":"$ 2,462.57"}},null,null,{"$f":"SUM(I11:I134)","v":{"v":6110,"d":"$ 6,110.00"}},"POR COBRAR"]
[]
[]
[null,"Se descuenta 5 USD por cada alumno que participe en Juegos Nacionales"]
[null,"AFILIACIÓN NUEVO CLUB",null,200]
[null,"PERSMISO ANUAL DE FUNCIONAMIENTO",null,70]
[null,"REAFILIACIÓN",null,100]
[]
[null,"PAGOS DEL 01-01-2025 A 15-03-2025"]

{"sheet":"GAL'S 2024  ","index":3,"n_rows":1539,"n_cols":13,"rows_kept":1539,"merged":[[0,5,0,6],[1,0,1,12]]}
[]
["LICENCIAS DE COMPETIDOR (05 DE SEPTIEMBRE  - DICIEMBRE  2024)"]
["FECHA","CLUB","CANT.","PRECIO UNITARIO","VALOR A PAGAR","EFECTIVO","TRANSFERENCIA","VALOR CANCELADO","ESTADO","SALDO","COSTO","GANANCIA","OBSERVACIONES"]
["2024-09-03","CAMU",1,{"v":6,"d":"$ 6.00"},{"$f":"C4*Tabla1442[[#This Row],[PRECIO UNITARIO]]","v":{"v":6,"d":"$ 6.00"}},0,{"v":6,"d":"$ 6.00"},{"$f":"F4+G4","v":{"v":6,"d":"$ 6.00"}},{"$f":"IF((E4=H4),\"CANCELADO\",\"SALDO PENDIENTE\")","v":"CANCELADO"},{"$f":"Tabla1442[[#This Row],[VALOR A PAGAR]]-Tabla1442[[#This Row],[VALOR CANCELADO]]","v":0},{"$f":"Tabla1442[[#This Row],[CANT.]]*2","v":{"v":2,"d":"$ 2.00"}},{"$f":"E4-K4","v":{"v":4,"d":"$ 4.00"}}]
["2024-09-04","RENACER",4,{"v":6,"d":"$ 6.00"},{"$f":"C5*Tabla1442[[#This Row],[PRECIO UNITARIO]]","v":{"v":24,"d":"$ 24.00"}},0,{"v":24,"d":"$ 24.00"},{"v":24,"d":"$ 24.00"},"CANCELADO",{"$f":"Tabla1442[[#This Row],[VALOR A PAGAR]]-Tabla1442[[#This Row],[VALOR CANCELADO]]","v":0},{"$f":"Tabla1442[[#This Row],[CANT.]]*2","v":{"v":8,"d":"$ 8.00"}},{"v":16,"d":"$ 16.00"}]
["2024-09-05","LEÓN",10,{"v":6,"d":"$ 6.00"},{"$f":"C6*Tabla1442[[#This Row],[PRECIO UNITARIO]]","v":{"v":60,"d":"$ 60.00"}},0,{"v":60,"d":"$ 60.00"},{"v":60,"d":"$ 60.00"},"CANCELADO",{"$f":"Tabla1442[[#This Row],[VALOR A PAGAR]]-Tabla1442[[#This Row],[VALOR CANCELADO]]","v":0},{"$f":"Tabla1442[[#This Row],[CANT.]]*2","v":{"v":20,"d":"$ 20.00"}},{"v":40,"d":"$ 40.00"}]
["2024-09-05","LEÓN",2,{"v":6,"d":"$ 6.00"},{"$f":"C7*Tabla1442[[#This Row],[PRECIO UNITARIO]]","v":{"v":12,"d":"$ 12.00"}},{"v":12,"d":"$ 12.00"},0,{"v":12,"d":"$ 12.00"},"CANCELADO",{"$f":"Tabla1442[[#This Row],[VALOR A PAGAR]]-Tabla1442[[#This Row],[VALOR CANCELADO]]","v":0},{"$f":"Tabla1442[[#This Row],[CANT.]]*2","v":{"v":4,"d":"$ 4.00"}},{"v":8,"d":"$ 8.00"}]
["2024-09-06","BORJA'S LIONS",2,{"v":6,"d":"$ 6.00"},{"$f":"C8*Tabla1442[[#This Row],[PRECIO UNITARIO]]","v":{"v":12,"d":"$ 12.00"}},0,{"v":12,"d":"$ 12.00"},{"v":12,"d":"$ 12.00"},"CANCELADO",{"$f":"Tabla1442[[#This Row],[VALOR A PAGAR]]-Tabla1442[[#This Row],[VALOR CANCELADO]]","v":0},{"$f":"Tabla1442[[#This Row],[CANT.]]*2","v":{"v":4,"d":"$ 4.00"}},{"v":8,"d":"$ 8.00"}]
["2024-09-06","KORYO",1,{"v":6,"d":"$ 6.00"},{"$f":"C9*Tabla1442[[#This Row],[PRECIO UNITARIO]]","v":{"v":6,"d":"$ 6.00"}},{"v":6,"d":"$ 6.00"},0,{"v":6,"d":"$ 6.00"},"CANCELADO",{"$f":"Tabla1442[[#This Row],[VALOR A PAGAR]]-Tabla1442[[#This Row],[VALOR CANCELADO]]","v":0},{"$f":"Tabla1442[[#This Row],[CANT.]]*2","v":{"v":2,"d":"$ 2.00"}},{"v":4,"d":"$ 4.00"}]
["2024-09-10","FARANG",1,{"v":6,"d":"$ 6.00"},{"$f":"C10*Tabla1442[[#This Row],[PRECIO UNITARIO]]","v":{"v":6,"d":"$ 6.00"}},0,{"v":6,"d":"$ 6.00"},{"v":6,"d":"$ 6.00"},"CANCELADO",{"$f":"Tabla1442[[#This Row],[VALOR A PAGAR]]-Tabla1442[[#This Row],[VALOR CANCELADO]]","v":0},{"$f":"Tabla1442[[#This Row],[CANT.]]*2","v":{"v":2,"d":"$ 2.00"}},{"v":4,"d":"$ 4.00"}]
["2024-09-10","KORYO DF DOJANG",2,{"v":6,"d":"$ 6.00"},{"$f":"C11*Tabla1442[[#This Row],[PRECIO UNITARIO]]","v":{"v":12,"d":"$ 12.00"}},{"v":12,"d":"$ 12.00"},0,{"v":12,"d":"$ 12.00"},"CANCELADO",{"$f":"Tabla1442[[#This Row],[VALOR A PAGAR]]-Tabla1442[[#This Row],[VALOR CANCELADO]]","v":0},{"$f":"Tabla1442[[#This Row],[CANT.]]*2","v":{"v":4,"d":"$ 4.00"}},{"v":8,"d":"$ 8.00"}]
["2024-09-11","ASOTKD - P CHIMBACALLE",3,{"v":6,"d":"$ 6.00"},{"$f":"C12*Tabla1442[[#This Row],[PRECIO UNITARIO]]","v":{"v":18,"d":"$ 18.00"}},{"v":18,"d":"$ 18.00"},0,{"v":18,"d":"$ 18.00"},"CANCELADO",{"$f":"Tabla1442[[#This Row],[VALOR A PAGAR]]-Tabla1442[[#This Row],[VALOR CANCELADO]]","v":0},{"$f":"Tabla1442[[#This Row],[CANT.]]*2","v":{"v":6,"d":"$ 6.00"}},{"v":12,"d":"$ 12.00"}]
["2024-09-11","SEÚL GEDEÓN",2,{"v":6,"d":"$ 6.00"},{"$f":"C13*Tabla1442[[#This Row],[PRECIO UNITARIO]]","v":{"v":12,"d":"$ 12.00"}},{"v":2,"d":"$ 2.00"},{"v":10,"d":"$ 10.00"},{"v":12,"d":"$ 12.00"},"CANCELADO",{"$f":"Tabla1442[[#This Row],[VALOR A PAGAR]]-Tabla1442[[#This Row],[VALOR CANCELADO]]","v":0},{"$f":"Tabla1442[[#This Row],[CANT.]]*2","v":{"v":4,"d":"$ 4.00"}},{"v":8,"d":"$ 8.00"}]
["2024-09-12","BORJA'S LIONS",1,{"v":2,"d":"$ 2.00"},{"$f":"C14*Tabla1442[[#This Row],[PRECIO UNITARIO]]","v":{"v":2,"d":"$ 2.00"}},0,{"v":2,"d":"$ 2.00"},{"v":2,"d":"$ 2.00"},"CANCELADO",{"$f":"Tabla1442[[#This Row],[VALOR A PAGAR]]-Tabla1442[[#This Row],[VALOR CANCELADO]]","v":0},{"$f":"Tabla1442[[#This Row],[CANT.]]*2","v":{"v":2,"d":"$ 2.00"}},0]
["2024-09-17","CAMU",9,{"v":6,"d":"$ 6.00"},{"$f":"C15*Tabla1442[[#This Row],[PRECIO UNITARIO]]","v":{"v":54,"d":"$ 54.00"}},0,{"v":54,"d":"$ 54.00"},{"v":54,"d":"$ 54.00"},"CANCELADO",{"$f":"Tabla1442[[#This Row],[VALOR A PAGAR]]-Tabla1442[[#This Row],[VALOR CANCELADO]]","v":0},{"$f":"Tabla1442[[#This Row],[CANT.]]*2","v":{"v":18,"d":"$ 18.00"}},{"v":36,"d":"$ 36.00"}]
["2024-09-17","DEBAK TKD",14,{"v":6,"d":"$ 6.00"},{"$f":"C16*Tabla1442[[#This Row],[PRECIO UNITARIO]]","v":{"v":84,"d":"$ 84.00"}},0,{"v":84,"d":"$ 84.00"},{"v":84,"d":"$ 84.00"},"CANCELADO",{"$f":"Tabla1442[[#This Row],[VALOR A PAGAR]]-Tabla1442[[#This Row],[VALOR CANCELADO]]","v":0},{"$f":"Tabla1442[[#This Row],[CANT.]]*2","v":{"v":28,"d":"$ 28.00"}},{"v":56,"d":"$ 56.00"}]
["2024-09-18","DEBAK TKD",1,{"v":6,"d":"$ 6.00"},{"$f":"C17*Tabla1442[[#This Row],[PRECIO UNITARIO]]","v":{"v":6,"d":"$ 6.00"}},0,{"v":6,"d":"$ 6.00"},{"v":6,"d":"$ 6.00"},"CANCELADO",{"$f":"Tabla1442[[#This Row],[VALOR A PAGAR]]-Tabla1442[[#This Row],[VALOR CANCELADO]]","v":0},{"$f":"Tabla1442[[#This Row],[CANT.]]*2","v":{"v":2,"d":"$ 2.00"}},{"v":4,"d":"$ 4.00"},"1º TRÁMITE DEL 18-09-2024"]
["2024-09-18","DEBAK TKD",1,{"v":6,"d":"$ 6.00"},{"$f":"C18*Tabla1442[[#This Row],[PRECIO UNITARIO]]","v":{"v":6,"d":"$ 6.00"}},0,{"v":6,"d":"$ 6.00"},{"v":6,"d":"$ 6.00"},"CANCELADO",{"$f":"Tabla1442[[#This Row],[VALOR A PAGAR]]-Tabla1442[[#This Row],[VALOR CANCELADO]]","v":0},{"$f":"Tabla1442[[#This Row],[CANT.]]*2","v":{"v":2,"d":"$ 2.00"}},{"v":4,"d":"$ 4.00"},"2º TRÁMITE DEL 18-09-2024"]
["2024-09-19","S. D. CENTRAL (LIVEO NAVAL)",11,{"v":6,"d":"$ 6.00"},{"$f":"C19*Tabla1442[[#This Row],[PRECIO UNITARIO]]","v":{"v":66,"d":"$ 66.00"}},0,{"v":66,"d":"$ 66.00"},{"v":66,"d":"$ 66.00"},"CANCELADO",{"$f":"Tabla1442[[#This Row],[VALOR A PAGAR]]-Tabla1442[[#This Row],[VALOR CANCELADO]]","v":0},{"$f":"Tabla1442[[#This Row],[CANT.]]*2","v":{"v":22,"d":"$ 22.00"}},{"v":44,"d":"$ 44.00"}]
["2024-09-19","EQUILIBRIO",1,{"v":6,"d":"$ 6.00"},{"$f":"C20*Tabla1442[[#This Row],[PRECIO UNITARIO]]","v":{"v":6,"d":"$ 6.00"}},0,{"v":6,"d":"$ 6.00"},{"v":6,"d":"$ 6.00"},"CANCELADO",{"$f":"Tabla1442[[#This Row],[VALOR A PAGAR]]-Tabla1442[[#This Row],[VALOR CANCELADO]]","v":0},{"$f":"Tabla1442[[#This Row],[CANT.]]*2","v":{"v":2,"d":"$ 2.00"}},{"v":4,"d":"$ 4.00"}]
["2024-09-19","SEÚL GEDEÓN",1,{"v":2,"d":"$ 2.00"},{"$f":"C21*Tabla1442[[#This Row],[PRECIO UNITARIO]]","v":{"v":2,"d":"$ 2.00"}},0,{"v":2,"d":"$ 2.00"},{"v":2,"d":"$ 2.00"},"CANCELADO",{"$f":"Tabla1442[[#This Row],[VALOR A PAGAR]]-Tabla1442[[#This Row],[VALOR CANCELADO]]","v":0},{"$f":"Tabla1442[[#This Row],[CANT.]]*2","v":{"v":2,"d":"$ 2.00"}},0]
["2024-09-24","KO AMÉRICA ",6,{"v":6,"d":"$ 6.00"},{"$f":"C22*Tabla1442[[#This Row],[PRECIO UNITARIO]]","v":{"v":36,"d":"$ 36.00"}},0,{"v":36,"d":"$ 36.00"},{"v":36,"d":"$ 36.00"},"CANCELADO",{"$f":"Tabla1442[[#This Row],[VALOR A PAGAR]]-Tabla1442[[#This Row],[VALOR CANCELADO]]","v":0},{"$f":"Tabla1442[[#This Row],[CANT.]]*2","v":{"v":12,"d":"$ 12.00"}},{"v":24,"d":"$ 24.00"}]
["2024-09-24","KO AMÉRICA ",1,{"v":6,"d":"$ 6.00"},{"$f":"C23*Tabla1442[[#This Row],[PRECIO UNITARIO]]","v":{"v":6,"d":"$ 6.00"}},0,{"v":6,"d":"$ 6.00"},{"v":6,"d":"$ 6.00"},"CANCELADO",{"$f":"Tabla1442[[#This Row],[VALOR A PAGAR]]-Tabla1442[[#This Row],[VALOR CANCELADO]]","v":0},{"$f":"Tabla1442[[#This Row],[CANT.]]*2","v":{"v":2,"d":"$ 2.00"}},{"v":4,"d":"$ 4.00"}]
["2024-09-24","DOJANG TKD MELO",4,{"v":6,"d":"$ 6.00"},{"$f":"C24*Tabla1442[[#This Row],[PRECIO UNITARIO]]","v":{"v":24,"d":"$ 24.00"}},0,{"v":24,"d":"$ 24.00"},{"v":24,"d":"$ 24.00"},"CANCELADO",{"$f":"Tabla1442[[#This Row],[VALOR A PAGAR]]-Tabla1442[[#This Row],[VALOR CANCELADO]]","v":0},{"$f":"Tabla1442[[#This Row],[CANT.]]*2","v":{"v":8,"d":"$ 8.00"}},{"v":16,"d":"$ 16.00"}]
["2024-09-25","RENACER",1,{"v":2,"d":"$ 2.00"},{"$f":"C25*Tabla1442[[#This Row],[PRECIO UNITARIO]]","v":{"v":2,"d":"$ 2.00"}},0,{"v":2,"d":"$ 2.00"},{"v":2,"d":"$ 2.00"},"CANCELADO",{"$f":"Tabla1442[[#This Row],[VALOR A PAGAR]]-Tabla1442[[#This Row],[VALOR CANCELADO]]","v":0},{"$f":"Tabla1442[[#This Row],[CANT.]]*2","v":{"v":2,"d":"$ 2.00"}},0,"REIMPRESIÓN"]
["2024-09-26","TAE KING'S",3,{"v":6,"d":"$ 6.00"},{"$f":"C26*Tabla1442[[#This Row],[PRECIO UNITARIO]]","v":{"v":18,"d":"$ 18.00"}},0,{"v":18,"d":"$ 18.00"},{"v":18,"d":"$ 18.00"},"CANCELADO",{"$f":"Tabla1442[[#This Row],[VALOR A PAGAR]]-Tabla1442[[#This Row],[VALOR CANCELADO]]","v":0},{"$f":"Tabla1442[[#This Row],[CANT.]]*2","v":{"v":6,"d":"$ 6.00"}},{"v":12,"d":"$ 12.00"}]
["2024-09-27","DEBAK TKD",1,{"v":2,"d":"$ 2.00"},{"$f":"C27*Tabla1442[[#This Row],[PRECIO UNITARIO]]","v":{"v":2,"d":"$ 2.00"}},0,{"v":2,"d":"$ 2.00"},{"v":2,"d":"$ 2.00"},"CANCELADO",{"$f":"Tabla1442[[#This Row],[VALOR A PAGAR]]-Tabla1442[[#This Row],[VALOR CANCELADO]]","v":0},{"$f":"Tabla1442[[#This Row],[CANT.]]*2","v":{"v":2,"d":"$ 2.00"}},0]
["2024-10-01","ESPE",15,{"v":6,"d":"$ 6.00"},{"$f":"C28*Tabla1442[[#This Row],[PRECIO UNITARIO]]","v":{"v":90,"d":"$ 90.00"}},0,{"v":90,"d":"$ 90.00"},{"v":90,"d":"$ 90.00"},"CANCELADO",{"$f":"Tabla1442[[#This Row],[VALOR A PAGAR]]-Tabla1442[[#This Row],[VALOR CANCELADO]]","v":0},{"$f":"Tabla1442[[#This Row],[CANT.]]*2","v":{"v":30,"d":"$ 30.00"}},{"v":60,"d":"$ 60.00"}]
["2024-10-01","BAEKJUL AYALAZ",8,{"v":6,"d":"$ 6.00"},{"$f":"C29*Tabla1442[[#This Row],[PRECIO UNITARIO]]","v":{"v":48,"d":"$ 48.00"}},0,{"v":48,"d":"$ 48.00"},{"v":48,"d":"$ 48.00"},"CANCELADO",{"$f":"Tabla1442[[#This Row],[VALOR A PAGAR]]-Tabla1442[[#This Row],[VALOR CANCELADO]]","v":0},{"$f":"Tabla1442[[#This Row],[CANT.]]*2","v":{"v":16,"d":"$ 16.00"}},{"v":32,"d":"$ 32.00"}]
["2024-10-02","DEBAK TKD",1,{"v":6,"d":"$ 6.00"},{"$f":"C30*Tabla1442[[#This Row],[PRECIO UNITARIO]]","v":{"v":6,"d":"$ 6.00"}},0,{"v":6,"d":"$ 6.00"},{"v":6,"d":"$ 6.00"},"CANCELADO",{"$f":"Tabla1442[[#This Row],[VALOR A PAGAR]]-Tabla1442[[#This Row],[VALOR CANCELADO]]","v":0},{"$f":"Tabla1442[[#This Row],[CANT.]]*2","v":{"v":2,"d":"$ 2.00"}},{"v":4,"d":"$ 4.00"}]
["2024-10-03","ASOTKD - P CHIMBACALLE",11,{"v":6,"d":"$ 6.00"},{"$f":"C31*Tabla1442[[#This Row],[PRECIO UNITARIO]]","v":{"v":66,"d":"$ 66.00"}},{"v":66,"d":"$ 66.00"},0,{"v":66,"d":"$ 66.00"},"CANCELADO",{"$f":"Tabla1442[[#This Row],[VALOR A PAGAR]]-Tabla1442[[#This Row],[VALOR CANCELADO]]","v":0},{"$f":"Tabla1442[[#This Row],[CANT.]]*2","v":{"v":22,"d":"$ 22.00"}},{"v":44,"d":"$ 44.00"}]
["2024-10-04","TAEKWONDO TRAINING CENTER",1,{"v":6,"d":"$ 6.00"},{"$f":"C32*Tabla1442[[#This Row],[PRECIO UNITARIO]]","v":{"v":6,"d":"$ 6.00"}},0,{"v":6,"d":"$ 6.00"},{"v":6,"d":"$ 6.00"},"CANCELADO",{"$f":"Tabla1442[[#This Row],[VALOR A PAGAR]]-Tabla1442[[#This Row],[VALOR CANCELADO]]","v":0},{"$f":"Tabla1442[[#This Row],[CANT.]]*2","v":{"v":2,"d":"$ 2.00"}},{"v":4,"d":"$ 4.00"}]
["2024-10-07","ASOTKD - P CHIMBACALLE",1,{"v":6,"d":"$ 6.00"},{"$f":"C33*Tabla1442[[#This Row],[PRECIO UNITARIO]]","v":{"v":6,"d":"$ 6.00"}},{"v":6,"d":"$ 6.00"},0,{"v":6,"d":"$ 6.00"},"CANCELADO",{"$f":"Tabla1442[[#This Row],[VALOR A PAGAR]]-Tabla1442[[#This Row],[VALOR CANCELADO]]","v":0},{"$f":"Tabla1442[[#This Row],[CANT.]]*2","v":{"v":2,"d":"$ 2.00"}},{"v":4,"d":"$ 4.00"}]
["2024-10-08","JIDOKWAN",1,{"v":6,"d":"$ 6.00"},{"$f":"C34*Tabla1442[[#This Row],[PRECIO UNITARIO]]","v":{"v":6,"d":"$ 6.00"}},{"v":6,"d":"$ 6.00"},0,{"v":6,"d":"$ 6.00"},"CANCELADO",{"$f":"Tabla1442[[#This Row],[VALOR A PAGAR]]-Tabla1442[[#This Row],[VALOR CANCELADO]]","v":0},{"$f":"Tabla1442[[#This Row],[CANT.]]*2","v":{"v":2,"d":"$ 2.00"}},{"v":4,"d":"$ 4.00"}]
["2024-10-08","MINOTAUROS",9,{"v":6,"d":"$ 6.00"},{"$f":"C35*Tabla1442[[#This Row],[PRECIO UNITARIO]]","v":{"v":54,"d":"$ 54.00"}},0,{"v":54,"d":"$ 54.00"},{"v":54,"d":"$ 54.00"},"CANCELADO",{"$f":"Tabla1442[[#This Row],[VALOR A PAGAR]]-Tabla1442[[#This Row],[VALOR CANCELADO]]","v":0},{"$f":"Tabla1442[[#This Row],[CANT.]]*2","v":{"v":18,"d":"$ 18.00"}},{"v":36,"d":"$ 36.00"}]
["2024-10-09","KO AMÉRICA DRAGON FIRE",4,{"v":6,"d":"$ 6.00"},{"$f":"C36*Tabla1442[[#This Row],[PRECIO UNITARIO]]","v":{"v":24,"d":"$ 24.00"}},0,{"v":24,"d":"$ 24.00"},{"$f":"F36+G36","v":{"v":24,"d":"$ 24.00"}},{"$f":"IF((E36=H36),\"CANCELADO\",\"SALDO PENDIENTE\")","v":"CANCELADO"},{"$f":"Tabla1442[[#This Row],[VALOR A PAGAR]]-Tabla1442[[#This Row],[VALOR CANCELADO]]","v":0},{"$f":"Tabla1442[[#This Row],[CANT.]]*2","v":{"v":8,"d":"$ 8.00"}},{"$f":"E36-K36","v":{"v":16,"d":"$ 16.00"}}]
["2024-10-16","ARES",1,{"v":6,"d":"$ 6.00"},{"$f":"C37*Tabla1442[[#This Row],[PRECIO UNITARIO]]","v":{"v":6,"d":"$ 6.00"}},0,{"v":6,"d":"$ 6.00"},{"v":6,"d":"$ 6.00"},"CANCELADO",{"$f":"Tabla1442[[#This Row],[VALOR A PAGAR]]-Tabla1442[[#This Row],[VALOR CANCELADO]]","v":0},{"$f":"Tabla1442[[#This Row],[CANT.]]*2","v":{"v":2,"d":"$ 2.00"}},{"v":4,"d":"$ 4.00"}]
["2024-10-18","ASOTKD - P CHIMBACALLE",5,{"v":6,"d":"$ 6.00"},{"$f":"C38*Tabla1442[[#This Row],[PRECIO UNITARIO]]","v":{"v":30,"d":"$ 30.00"}},{"v":30,"d":"$ 30.00"},0,{"v":30,"d":"$ 30.00"},"CANCELADO",{"$f":"Tabla1442[[#This Row],[VALOR A PAGAR]]-Tabla1442[[#This Row],[VALOR CANCELADO]]","v":0},{"$f":"Tabla1442[[#This Row],[CANT.]]*2","v":{"v":10,"d":"$ 10.00"}},{"v":20,"d":"$ 20.00"}]
["2024-10-18","MILLENIUM",3,{"v":6,"d":"$ 6.00"},{"$f":"C39*Tabla1442[[#This Row],[PRECIO UNITARIO]]","v":{"v":18,"d":"$ 18.00"}},0,{"v":18,"d":"$ 18.00"},{"v":18,"d":"$ 18.00"},"CANCELADO",{"$f":"Tabla1442[[#This Row],[VALOR A PAGAR]]-Tabla1442[[#This Row],[VALOR CANCELADO]]","v":0},{"$f":"Tabla1442[[#This Row],[CANT.]]*2","v":{"v":6,"d":"$ 6.00"}},{"v":12,"d":"$ 12.00"}]
["2024-10-22","DRAGON GYM",15,{"v":6,"d":"$ 6.00"},{"$f":"C40*Tabla1442[[#This Row],[PRECIO UNITARIO]]","v":{"v":90,"d":"$ 90.00"}},0,{"v":90,"d":"$ 90.00"},{"v":90,"d":"$ 90.00"},"CANCELADO",{"$f":"Tabla1442[[#This Row],[VALOR A PAGAR]]-Tabla1442[[#This Row],[VALOR CANCELADO]]","v":0},{"$f":"Tabla1442[[#This Row],[CANT.]]*2","v":{"v":30,"d":"$ 30.00"}},{"v":60,"d":"$ 60.00"}]
["2024-10-22","DRAGON GYM",1,{"v":6,"d":"$ 6.00"},{"$f":"C41*Tabla1442[[#This Row],[PRECIO UNITARIO]]","v":{"v":6,"d":"$ 6.00"}},0,{"v":6,"d":"$ 6.00"},{"v":6,"d":"$ 6.00"},"CANCELADO",{"$f":"Tabla1442[[#This Row],[VALOR A PAGAR]]-Tabla1442[[#This Row],[VALOR CANCELADO]]","v":0},{"$f":"Tabla1442[[#This Row],[CANT.]]*2","v":{"v":2,"d":"$ 2.00"}},{"v":4,"d":"$ 4.00"}]
["2024-10-23","DRAGON GYM",7,{"v":6,"d":"$ 6.00"},{"$f":"C42*Tabla1442[[#This Row],[PRECIO UNITARIO]]","v":{"v":42,"d":"$ 42.00"}},0,{"v":42,"d":"$ 42.00"},{"v":42,"d":"$ 42.00"},"CANCELADO",{"$f":"Tabla1442[[#This Row],[VALOR A PAGAR]]-Tabla1442[[#This Row],[VALOR CANCELADO]]","v":0},{"$f":"Tabla1442[[#This Row],[CANT.]]*2","v":{"v":14,"d":"$ 14.00"}},{"v":28,"d":"$ 28.00"},"REIMPRESIÓN AÑOS ANTERIORES"]
["2024-10-25","DRAGON GYM",1,{"v":2,"d":"$ 2.00"},{"$f":"C43*Tabla1442[[#This Row],[PRECIO UNITARIO]]","v":{"v":2,"d":"$ 2.00"}},0,{"v":2,"d":"$ 2.00"},{"v":2,"d":"$ 2.00"},"CANCELADO",{"$f":"Tabla1442[[#This Row],[VALOR A PAGAR]]-Tabla1442[[#This Row],[VALOR CANCELADO]]","v":0},{"$f":"Tabla1442[[#This Row],[CANT.]]*2","v":{"v":2,"d":"$ 2.00"}},0,"REIMPRESIÓN AÑOS ANTERIORES"]
["2024-11-05","BAS PANTHERS",6,{"v":8,"d":"$ 8.00"},{"$f":"C44*Tabla1442[[#This Row],[PRECIO UNITARIO]]","v":{"v":48,"d":"$ 48.00"}},0,{"v":48,"d":"$ 48.00"},{"v":48,"d":"$ 48.00"},"CANCELADO",{"$f":"Tabla1442[[#This Row],[VALOR A PAGAR]]-Tabla1442[[#This Row],[VALOR CANCELADO]]","v":0},{"$f":"Tabla1442[[#This Row],[CANT.]]*2","v":{"v":12,"d":"$ 12.00"}},{"v":36,"d":"$ 36.00"},"GAL'S CON VIGENCIA 2025"]
["2024-11-05","SAN FRANCISCO TIGRES",2,{"v":6,"d":"$ 6.00"},{"$f":"C45*Tabla1442[[#This Row],[PRECIO UNITARIO]]","v":{"v":12,"d":"$ 12.00"}},0,{"v":12,"d":"$ 12.00"},{"v":12,"d":"$ 12.00"},"CANCELADO",{"$f":"Tabla1442[[#This Row],[VALOR A PAGAR]]-Tabla1442[[#This Row],[VALOR CANCELADO]]","v":0},{"$f":"Tabla1442[[#This Row],[CANT.]]*2","v":{"v":4,"d":"$ 4.00"}},{"v":8,"d":"$ 8.00"},"GAL'S CON VIGENCIA 2025"]
["2024-11-07","MIKIDO",6,{"v":8,"d":"$ 8.00"},{"$f":"C46*Tabla1442[[#This Row],[PRECIO UNITARIO]]","v":{"v":48,"d":"$ 48.00"}},0,{"v":48,"d":"$ 48.00"},{"v":48,"d":"$ 48.00"},"CANCELADO",{"$f":"Tabla1442[[#This Row],[VALOR A PAGAR]]-Tabla1442[[#This Row],[VALOR CANCELADO]]","v":0},{"$f":"Tabla1442[[#This Row],[CANT.]]*2","v":{"v":12,"d":"$ 12.00"}},{"v":36,"d":"$ 36.00"},"GAL'S CON VIGENCIA 2025"]
["2024-11-07","MARCIAL GRANDA",6,{"v":8,"d":"$ 8.00"},{"$f":"C47*Tabla1442[[#This Row],[PRECIO UNITARIO]]","v":{"v":48,"d":"$ 48.00"}},0,{"v":48,"d":"$ 48.00"},{"v":48,"d":"$ 48.00"},"CANCELADO",{"$f":"Tabla1442[[#This Row],[VALOR A PAGAR]]-Tabla1442[[#This Row],[VALOR CANCELADO]]","v":0},{"$f":"Tabla1442[[#This Row],[CANT.]]*2","v":{"v":12,"d":"$ 12.00"}},{"v":36,"d":"$ 36.00"},"GAL'S CON VIGENCIA 2025"]
["2024-11-08","DEBAK TKD",15,{"v":8,"d":"$ 8.00"},{"$f":"C48*Tabla1442[[#This Row],[PRECIO UNITARIO]]","v":{"v":120,"d":"$ 120.00"}},0,{"v":120,"d":"$ 120.00"},{"v":120,"d":"$ 120.00"},"CANCELADO",{"$f":"Tabla1442[[#This Row],[VALOR A PAGAR]]-Tabla1442[[#This Row],[VALOR CANCELADO]]","v":0},{"$f":"Tabla1442[[#This Row],[CANT.]]*2","v":{"v":30,"d":"$ 30.00"}},{"v":90,"d":"$ 90.00"},"GAL'S CON VIGENCIA 2025"]
["2024-11-11","KYORUGUI GYM",9,{"v":8,"d":"$ 8.00"},{"$f":"C49*Tabla1442[[#This Row],[PRECIO UNITARIO]]","v":{"v":72,"d":"$ 72.00"}},0,{"v":72,"d":"$ 72.00"},{"v":72,"d":"$ 72.00"},"CANCELADO",{"$f":"Tabla1442[[#This Row],[VALOR A PAGAR]]-Tabla1442[[#This Row],[VALOR CANCELADO]]","v":0},{"$f":"Tabla1442[[#This Row],[CANT.]]*2","v":{"v":18,"d":"$ 18.00"}},{"v":54,"d":"$ 54.00"},"GAL'S CON VIGENCIA 2025"]
["2024-11-11","SURYUN",17,{"v":6,"d":"$ 6.00"},{"$f":"C50*Tabla1442[[#This Row],[PRECIO UNITARIO]]","v":{"v":102,"d":"$ 102.00"}},0,{"v":102,"d":"$ 102.00"},{"v":102,"d":"$ 102.00"},"CANCELADO",{"$f":"Tabla1442[[#This Row],[VALOR A PAGAR]]-Tabla1442[[#This Row],[VALOR CANCELADO]]","v":0},{"$f":"Tabla1442[[#This Row],[CANT.]]*2","v":{"v":34,"d":"$ 34.00"}},{"v":68,"d":"$ 68.00"},"GAL'S CON VIGENCIA 2025"]
["2024-11-12","SAN SEBASTIÁN (LUIS TIPÁN)",4,{"v":6,"d":"$ 6.00"},{"$f":"C51*Tabla1442[[#This Row],[PRECIO UNITARIO]]","v":{"v":24,"d":"$ 24.00"}},0,{"v":24,"d":"$ 24.00"},{"v":24,"d":"$ 24.00"},"CANCELADO",{"$f":"Tabla1442[[#This Row],[VALOR A PAGAR]]-Tabla1442[[#This Row],[VALOR CANCELADO]]","v":0},{"$f":"Tabla1442[[#This Row],[CANT.]]*2","v":{"v":8,"d":"$ 8.00"}},{"v":16,"d":"$ 16.00"},"GAL'S CON VIGENCIA 2025"]
["2024-11-12","MARCIAL GRANDA",1,{"v":8,"d":"$ 8.00"},{"$f":"C52*Tabla1442[[#This Row],[PRECIO UNITARIO]]","v":{"v":8,"d":"$ 8.00"}},0,{"v":8,"d":"$ 8.00"},{"v":8,"d":"$ 8.00"},"CANCELADO",{"$f":"Tabla1442[[#This Row],[VALOR A PAGAR]]-Tabla1442[[#This Row],[VALOR CANCELADO]]","v":0},{"$f":"Tabla1442[[#This Row],[CANT.]]*2","v":{"v":2,"d":"$ 2.00"}},{"v":6,"d":"$ 6.00"},"GAL'S CON VIGENCIA 2025"]
["2024-11-12","SURYUN",9,{"v":6,"d":"$ 6.00"},{"$f":"C53*Tabla1442[[#This Row],[PRECIO UNITARIO]]","v":{"v":54,"d":"$ 54.00"}},0,{"v":54,"d":"$ 54.00"},{"v":54,"d":"$ 54.00"},"CANCELADO",{"$f":"Tabla1442[[#This Row],[VALOR A PAGAR]]-Tabla1442[[#This Row],[VALOR CANCELADO]]","v":0},{"$f":"Tabla1442[[#This Row],[CANT.]]*2","v":{"v":18,"d":"$ 18.00"}},{"v":36,"d":"$ 36.00"},"GAL'S CON VIGENCIA 2025"]
["2024-11-12","DOJANG TKD MELO",1,{"v":6,"d":"$ 6.00"},{"$f":"C54*Tabla1442[[#This Row],[PRECIO UNITARIO]]","v":{"v":6,"d":"$ 6.00"}},0,{"v":6,"d":"$ 6.00"},{"v":6,"d":"$ 6.00"},"CANCELADO",{"$f":"Tabla1442[[#This Row],[VALOR A PAGAR]]-Tabla1442[[#This Row],[VALOR CANCELADO]]","v":0},{"$f":"Tabla1442[[#This Row],[CANT.]]*2","v":{"v":2,"d":"$ 2.00"}},{"v":4,"d":"$ 4.00"},"GAL'S CON VIGENCIA 2025"]
["2024-11-12","TAEGUK JUCARO",10,{"v":8,"d":"$ 8.00"},{"$f":"C55*Tabla1442[[#This Row],[PRECIO UNITARIO]]","v":{"v":80,"d":"$ 80.00"}},0,{"v":80,"d":"$ 80.00"},{"v":80,"d":"$ 80.00"},"CANCELADO",{"$f":"Tabla1442[[#This Row],[VALOR A PAGAR]]-Tabla1442[[#This Row],[VALOR CANCELADO]]","v":0},{"$f":"Tabla1442[[#This Row],[CANT.]]*2","v":{"v":20,"d":"$ 20.00"}},{"v":60,"d":"$ 60.00"},"GAL'S CON VIGENCIA 2025"]
["2024-11-12","SEUL GEDEON",2,{"v":8,"d":"$ 8.00"},{"$f":"C56*Tabla1442[[#This Row],[PRECIO UNITARIO]]","v":{"v":16,"d":"$ 16.00"}},0,{"v":16,"d":"$ 16.00"},{"v":16,"d":"$ 16.00"},"CANCELADO",{"$f":"Tabla1442[[#This Row],[VALOR A PAGAR]]-Tabla1442[[#This Row],[VALOR CANCELADO]]","v":0},{"$f":"Tabla1442[[#This Row],[CANT.]]*2","v":{"v":4,"d":"$ 4.00"}},{"v":12,"d":"$ 12.00"},"GAL'S CON VIGENCIA 2025"]
["2024-11-12","APOLO",11,{"v":6,"d":"$ 6.00"},{"$f":"C57*Tabla1442[[#This Row],[PRECIO UNITARIO]]","v":{"v":66,"d":"$ 66.00"}},0,{"v":66,"d":"$ 66.00"},{"v":66,"d":"$ 66.00"},"CANCELADO",{"$f":"Tabla1442[[#This Row],[VALOR A PAGAR]]-Tabla1442[[#This Row],[VALOR CANCELADO]]","v":0},{"$f":"Tabla1442[[#This Row],[CANT.]]*2","v":{"v":22,"d":"$ 22.00"}},{"v":44,"d":"$ 44.00"},"GAL'S CON VIGENCIA 2025"]
["2024-11-12","APOLO",9,{"v":6,"d":"$ 6.00"},{"$f":"C58*Tabla1442[[#This Row],[PRECIO UNITARIO]]","v":{"v":54,"d":"$ 54.00"}},0,{"v":54,"d":"$ 54.00"},{"v":54,"d":"$ 54.00"},"CANCELADO",{"$f":"Tabla1442[[#This Row],[VALOR A PAGAR]]-Tabla1442[[#This Row],[VALOR CANCELADO]]","v":0},{"$f":"Tabla1442[[#This Row],[CANT.]]*2","v":{"v":18,"d":"$ 18.00"}},{"v":36,"d":"$ 36.00"},"GAL'S CON VIGENCIA 2025"]
["2024-11-13","SURYUN",1,{"v":6,"d":"$ 6.00"},{"$f":"C59*Tabla1442[[#This Row],[PRECIO UNITARIO]]","v":{"v":6,"d":"$ 6.00"}},0,{"v":6,"d":"$ 6.00"},{"v":6,"d":"$ 6.00"},"CANCELADO",{"$f":"Tabla1442[[#This Row],[VALOR A PAGAR]]-Tabla1442[[#This Row],[VALOR CANCELADO]]","v":0},{"$f":"Tabla1442[[#This Row],[CANT.]]*2","v":{"v":2,"d":"$ 2.00"}},{"v":4,"d":"$ 4.00"},"GAL'S CON VIGENCIA 2025"]
["2024-11-13","USFQ",1,{"v":6,"d":"$ 6.00"},{"$f":"C60*Tabla1442[[#This Row],[PRECIO UNITARIO]]","v":{"v":6,"d":"$ 6.00"}},0,{"v":6,"d":"$ 6.00"},{"v":6,"d":"$ 6.00"},"CANCELADO",{"$f":"Tabla1442[[#This Row],[VALOR A PAGAR]]-Tabla1442[[#This Row],[VALOR CANCELADO]]","v":0},{"$f":"Tabla1442[[#This Row],[CANT.]]*2","v":{"v":2,"d":"$ 2.00"}},{"v":4,"d":"$ 4.00"},"GAL'S CON VIGENCIA 2025"]
["2024-11-13","USFQ",3,{"v":6,"d":"$ 6.00"},{"$f":"C61*Tabla1442[[#This Row],[PRECIO UNITARIO]]","v":{"v":18,"d":"$ 18.00"}},0,{"v":18,"d":"$ 18.00"},{"v":18,"d":"$ 18.00"},"CANCELADO",{"$f":"Tabla1442[[#This Row],[VALOR A PAGAR]]-Tabla1442[[#This Row],[VALOR CANCELADO]]","v":0},{"$f":"Tabla1442[[#This Row],[CANT.]]*2","v":{"v":6,"d":"$ 6.00"}},{"v":12,"d":"$ 12.00"},"GAL'S CON VIGENCIA 2025"]
["2024-11-13","MARCIAL GRANDA",1,{"v":8,"d":"$ 8.00"},{"$f":"C62*Tabla1442[[#This Row],[PRECIO UNITARIO]]","v":{"v":8,"d":"$ 8.00"}},0,{"v":8,"d":"$ 8.00"},{"v":8,"d":"$ 8.00"},"CANCELADO",{"$f":"Tabla1442[[#This Row],[VALOR A PAGAR]]-Tabla1442[[#This Row],[VALOR CANCELADO]]","v":0},{"$f":"Tabla1442[[#This Row],[CANT.]]*2","v":{"v":2,"d":"$ 2.00"}},{"v":6,"d":"$ 6.00"},"GAL'S CON VIGENCIA 2025"]
["2024-11-13","BORJA'S LIONS",3,{"v":6,"d":"$ 6.00"},{"$f":"C63*Tabla1442[[#This Row],[PRECIO UNITARIO]]","v":{"v":18,"d":"$ 18.00"}},0,{"v":18,"d":"$ 18.00"},{"v":18,"d":"$ 18.00"},"CANCELADO",{"$f":"Tabla1442[[#This Row],[VALOR A PAGAR]]-Tabla1442[[#This Row],[VALOR CANCELADO]]","v":0},{"$f":"Tabla1442[[#This Row],[CANT.]]*2","v":{"v":6,"d":"$ 6.00"}},{"v":12,"d":"$ 12.00"},"GAL'S CON VIGENCIA 2025"]
["2024-11-13","KUMGANG DUL",4,{"v":6,"d":"$ 6.00"},{"$f":"C64*Tabla1442[[#This Row],[PRECIO UNITARIO]]","v":{"v":24,"d":"$ 24.00"}},0,{"v":24,"d":"$ 24.00"},{"v":24,"d":"$ 24.00"},"CANCELADO",{"$f":"Tabla1442[[#This Row],[VALOR A PAGAR]]-Tabla1442[[#This Row],[VALOR CANCELADO]]","v":0},{"$f":"Tabla1442[[#This Row],[CANT.]]*2","v":{"v":8,"d":"$ 8.00"}},{"v":16,"d":"$ 16.00"},"GAL'S CON VIGENCIA 2025"]
["2024-11-13","L. D. C. MEJÍA",2,{"v":8,"d":"$ 8.00"},{"$f":"C65*Tabla1442[[#This Row],[PRECIO UNITARIO]]","v":{"v":16,"d":"$ 16.00"}},0,{"v":16,"d":"$ 16.00"},{"v":16,"d":"$ 16.00"},"CANCELADO",{"$f":"Tabla1442[[#This Row],[VALOR A PAGAR]]-Tabla1442[[#This Row],[VALOR CANCELADO]]","v":0},{"$f":"Tabla1442[[#This Row],[CANT.]]*2","v":{"v":4,"d":"$ 4.00"}},{"v":12,"d":"$ 12.00"},"GAL'S CON VIGENCIA 2025"]
["2024-11-13","ARES",2,{"v":8,"d":"$ 8.00"},{"$f":"C66*Tabla1442[[#This Row],[PRECIO UNITARIO]]","v":{"v":16,"d":"$ 16.00"}},0,{"v":16,"d":"$ 16.00"},{"v":16,"d":"$ 16.00"},"CANCELADO",{"$f":"Tabla1442[[#This Row],[VALOR A PAGAR]]-Tabla1442[[#This Row],[VALOR CANCELADO]]","v":0},{"$f":"Tabla1442[[#This Row],[CANT.]]*2","v":{"v":4,"d":"$ 4.00"}},{"v":12,"d":"$ 12.00"},"GAL'S CON VIGENCIA 2025"]
["2024-11-14","BLUE DRAGONS",10,{"v":8,"d":"$ 8.00"},{"$f":"C67*Tabla1442[[#This Row],[PRECIO UNITARIO]]","v":{"v":80,"d":"$ 80.00"}},0,{"v":80,"d":"$ 80.00"},{"v":80,"d":"$ 80.00"},"CANCELADO",{"$f":"Tabla1442[[#This Row],[VALOR A PAGAR]]-Tabla1442[[#This Row],[VALOR CANCELADO]]","v":0},{"$f":"Tabla1442[[#This Row],[CANT.]]*2","v":{"v":20,"d":"$ 20.00"}},{"v":60,"d":"$ 60.00"},"GAL'S CON VIGENCIA 2025"]
["2024-11-14","BORJA'S LIONS",4,{"v":6,"d":"$ 6.00"},{"$f":"C68*Tabla1442[[#This Row],[PRECIO UNITARIO]]","v":{"v":24,"d":"$ 24.00"}},0,{"v":24,"d":"$ 24.00"},{"$f":"F68+G68","v":{"v":24,"d":"$ 24.00"}},{"$f":"IF((E68=H68),\"CANCELADO\",\"SALDO PENDIENTE\")","v":"CANCELADO"},{"$f":"Tabla1442[[#This Row],[VALOR A PAGAR]]-Tabla1442[[#This Row],[VALOR CANCELADO]]","v":0},{"$f":"Tabla1442[[#This Row],[CANT.]]*2","v":{"v":8,"d":"$ 8.00"}},{"$f":"E68-K68","v":{"v":16,"d":"$ 16.00"}},"GAL'S CON VIGENCIA 2025"]
["2024-11-14","TOTAL KOMBAT",5,{"v":6,"d":"$ 6.00"},{"$f":"C69*Tabla1442[[#This Row],[PRECIO UNITARIO]]","v":{"v":30,"d":"$ 30.00"}},0,{"v":30,"d":"$ 30.00"},{"v":30,"d":"$ 30.00"},"CANCELADO",{"$f":"Tabla1442[[#This Row],[VALOR A PAGAR]]-Tabla1442[[#This Row],[VALOR CANCELADO]]","v":0},{"$f":"Tabla1442[[#This Row],[CANT.]]*2","v":{"v":10,"d":"$ 10.00"}},{"v":20,"d":"$ 20.00"},"CANCELA EN TRES DEPÓSITOS (13 Y 14 DE NOV 2024)"]
["2024-11-14","BLUE DRAGONS",1,{"v":8,"d":"$ 8.00"},{"$f":"C70*Tabla1442[[#This Row],[PRECIO UNITARIO]]","v":{"v":8,"d":"$ 8.00"}},0,{"v":8,"d":"$ 8.00"},{"v":8,"d":"$ 8.00"},"CANCELADO",{"$f":"Tabla1442[[#This Row],[VALOR A PAGAR]]-Tabla1442[[#This Row],[VALOR CANCELADO]]","v":0},{"$f":"Tabla1442[[#This Row],[CANT.]]*2","v":{"v":2,"d":"$ 2.00"}},{"v":6,"d":"$ 6.00"},"GAL'S CON VIGENCIA 2025"]
["2024-11-14","BAEKJUL AYALAZ",8,{"v":8,"d":"$ 8.00"},{"$f":"C71*Tabla1442[[#This Row],[PRECIO UNITARIO]]","v":{"v":64,"d":"$ 64.00"}},0,{"v":64,"d":"$ 64.00"},{"v":64,"d":"$ 64.00"},"CANCELADO",{"$f":"Tabla1442[[#This Row],[VALOR A PAGAR]]-Tabla1442[[#This Row],[VALOR CANCELADO]]","v":0},{"$f":"Tabla1442[[#This Row],[CANT.]]*2","v":{"v":16,"d":"$ 16.00"}},{"v":48,"d":"$ 48.00"},"GAL'S CON VIGENCIA 2025"]
["2024-11-14","BAEKJUL AYALAZ",1,{"v":8,"d":"$ 8.00"},{"$f":"C72*Tabla1442[[#This Row],[PRECIO UNITARIO]]","v":{"v":8,"d":"$ 8.00"}},0,{"v":8,"d":"$ 8.00"},{"v":8,"d":"$ 8.00"},"CANCELADO",{"$f":"Tabla1442[[#This Row],[VALOR A PAGAR]]-Tabla1442[[#This Row],[VALOR CANCELADO]]","v":0},{"$f":"Tabla1442[[#This Row],[CANT.]]*2","v":{"v":2,"d":"$ 2.00"}},{"v":6,"d":"$ 6.00"},"GAL'S CON VIGENCIA 2025"]
["2024-11-14","EQUILIBRIO",22,{"v":8,"d":"$ 8.00"},{"$f":"C73*Tabla1442[[#This Row],[PRECIO UNITARIO]]","v":{"v":176,"d":"$ 176.00"}},0,{"v":176,"d":"$ 176.00"},{"v":176,"d":"$ 176.00"},"CANCELADO",{"$f":"Tabla1442[[#This Row],[VALOR A PAGAR]]-Tabla1442[[#This Row],[VALOR CANCELADO]]","v":0},{"$f":"Tabla1442[[#This Row],[CANT.]]*2","v":{"v":44,"d":"$ 44.00"}},{"v":132,"d":"$ 132.00"},"GAL'S CON VIGENCIA 2025"]
["2024-11-14","EQUILIBRIO",2,{"v":6,"d":"$ 6.00"},{"$f":"C74*Tabla1442[[#This Row],[PRECIO UNITARIO]]","v":{"v":12,"d":"$ 12.00"}},0,{"v":12,"d":"$ 12.00"},{"v":12,"d":"$ 12.00"},"CANCELADO",{"$f":"Tabla1442[[#This Row],[VALOR A PAGAR]]-Tabla1442[[#This Row],[VALOR CANCELADO]]","v":0},{"$f":"Tabla1442[[#This Row],[CANT.]]*2","v":{"v":4,"d":"$ 4.00"}},{"v":8,"d":"$ 8.00"},"GAL'S CON VIGENCIA 2025"]
["2024-11-14","SEUL",1,{"v":6,"d":"$ 6.00"},{"$f":"C75*Tabla1442[[#This Row],[PRECIO UNITARIO]]","v":{"v":6,"d":"$ 6.00"}},0,{"v":6,"d":"$ 6.00"},{"v":6,"d":"$ 6.00"},"CANCELADO",{"$f":"Tabla1442[[#This Row],[VALOR A PAGAR]]-Tabla1442[[#This Row],[VALOR CANCELADO]]","v":0},{"$f":"Tabla1442[[#This Row],[CANT.]]*2","v":{"v":2,"d":"$ 2.00"}},{"v":4,"d":"$ 4.00"},"GAL'S CON VIGENCIA 2025"]
["2024-11-14","SEUL ",1,{"v":6,"d":"$ 6.00"},{"$f":"C76*Tabla1442[[#This Row],[PRECIO UNITARIO]]","v":{"v":6,"d":"$ 6.00"}},0,{"v":6,"d":"$ 6.00"},{"v":6,"d":"$ 6.00"},"CANCELADO",{"$f":"Tabla1442[[#This Row],[VALOR A PAGAR]]-Tabla1442[[#This Row],[VALOR CANCELADO]]","v":0},{"$f":"Tabla1442[[#This Row],[CANT.]]*2","v":{"v":2,"d":"$ 2.00"}},{"v":4,"d":"$ 4.00"},"GAL'S CON VIGENCIA 2025"]
["2024-11-14","BAEKJUL",4,{"v":6,"d":"$ 6.00"},{"$f":"C77*Tabla1442[[#This Row],[PRECIO UNITARIO]]","v":{"v":24,"d":"$ 24.00"}},0,{"v":24,"d":"$ 24.00"},{"v":24,"d":"$ 24.00"},"CANCELADO",{"$f":"Tabla1442[[#This Row],[VALOR A PAGAR]]-Tabla1442[[#This Row],[VALOR CANCELADO]]","v":0},{"$f":"Tabla1442[[#This Row],[CANT.]]*2","v":{"v":8,"d":"$ 8.00"}},{"v":16,"d":"$ 16.00"},"GAL'S CON VIGENCIA 2025"]
["2024-11-14","BAEKJUL",1,{"v":6,"d":"$ 6.00"},{"$f":"C78*Tabla1442[[#This Row],[PRECIO UNITARIO]]","v":{"v":6,"d":"$ 6.00"}},0,{"v":6,"d":"$ 6.00"},{"v":6,"d":"$ 6.00"},"CANCELADO",{"$f":"Tabla1442[[#This Row],[VALOR A PAGAR]]-Tabla1442[[#This Row],[VALOR CANCELADO]]","v":0},{"$f":"Tabla1442[[#This Row],[CANT.]]*2","v":{"v":2,"d":"$ 2.00"}},{"v":4,"d":"$ 4.00"},"GAL'S CON VIGENCIA 2025"]
["2024-11-14","ASOTKD - P CHIMBACALLE",6,{"v":8,"d":"$ 8.00"},{"$f":"C79*Tabla1442[[#This Row],[PRECIO UNITARIO]]","v":{"v":48,"d":"$ 48.00"}},{"v":48,"d":"$ 48.00"},0,{"v":48,"d":"$ 48.00"},"CANCELADO",{"$f":"Tabla1442[[#This Row],[VALOR A PAGAR]]-Tabla1442[[#This Row],[VALOR CANCELADO]]","v":0},{"$f":"Tabla1442[[#This Row],[CANT.]]*2","v":{"v":12,"d":"$ 12.00"}},{"v":36,"d":"$ 36.00"},"GAL'S CON VIGENCIA 2025"]
["2024-11-14","SEUL ",1,{"v":8,"d":"$ 8.00"},{"$f":"C80*Tabla1442[[#This Row],[PRECIO UNITARIO]]","v":{"v":8,"d":"$ 8.00"}},0,{"v":8,"d":"$ 8.00"},{"v":8,"d":"$ 8.00"},"CANCELADO",{"$f":"Tabla1442[[#This Row],[VALOR A PAGAR]]-Tabla1442[[#This Row],[VALOR CANCELADO]]","v":0},{"$f":"Tabla1442[[#This Row],[CANT.]]*2","v":{"v":2,"d":"$ 2.00"}},{"v":6,"d":"$ 6.00"},"GAL'S CON VIGENCIA 2025"]
["2024-11-14","APOLO",5,{"v":6,"d":"$ 6.00"},{"$f":"C81*Tabla1442[[#This Row],[PRECIO UNITARIO]]","v":{"v":30,"d":"$ 30.00"}},0,{"v":30,"d":"$ 30.00"},{"v":30,"d":"$ 30.00"},"CANCELADO",{"$f":"Tabla1442[[#This Row],[VALOR A PAGAR]]-Tabla1442[[#This Row],[VALOR CANCELADO]]","v":0},{"$f":"Tabla1442[[#This Row],[CANT.]]*2","v":{"v":10,"d":"$ 10.00"}},{"v":20,"d":"$ 20.00"},"GAL'S CON VIGENCIA 2025"]
["2024-11-14","APOLO",1,{"v":6,"d":"$ 6.00"},{"$f":"C82*Tabla1442[[#This Row],[PRECIO UNITARIO]]","v":{"v":6,"d":"$ 6.00"}},0,{"v":6,"d":"$ 6.00"},{"v":6,"d":"$ 6.00"},"CANCELADO",{"$f":"Tabla1442[[#This Row],[VALOR A PAGAR]]-Tabla1442[[#This Row],[VALOR CANCELADO]]","v":0},{"$f":"Tabla1442[[#This Row],[CANT.]]*2","v":{"v":2,"d":"$ 2.00"}},{"v":4,"d":"$ 4.00"},"GAL'S CON VIGENCIA 2025"]
["2024-11-14","FURIA NEGRA",2,{"v":8,"d":"$ 8.00"},{"$f":"C83*Tabla1442[[#This Row],[PRECIO UNITARIO]]","v":{"v":16,"d":"$ 16.00"}},0,{"v":16,"d":"$ 16.00"},{"v":16,"d":"$ 16.00"},"CANCELADO",{"$f":"Tabla1442[[#This Row],[VALOR A PAGAR]]-Tabla1442[[#This Row],[VALOR CANCELADO]]","v":0},{"$f":"Tabla1442[[#This Row],[CANT.]]*2","v":{"v":4,"d":"$ 4.00"}},{"v":12,"d":"$ 12.00"},"GAL'S CON VIGENCIA 2025"]
["2024-11-14","FURIA NEGRA",1,{"v":6,"d":"$ 6.00"},{"$f":"C84*Tabla1442[[#This Row],[PRECIO UNITARIO]]","v":{"v":6,"d":"$ 6.00"}},0,{"v":6,"d":"$ 6.00"},{"v":6,"d":"$ 6.00"},"CANCELADO",{"$f":"Tabla1442[[#This Row],[VALOR A PAGAR]]-Tabla1442[[#This Row],[VALOR CANCELADO]]","v":0},{"$f":"Tabla1442[[#This Row],[CANT.]]*2","v":{"v":2,"d":"$ 2.00"}},{"v":4,"d":"$ 4.00"},"GAL'S CON VIGENCIA 2025"]
["2024-11-14","PVM - ROJAS IAN IRON FIST",1,{"v":6,"d":"$ 6.00"},{"$f":"C85*Tabla1442[[#This Row],[PRECIO UNITARIO]]","v":{"v":6,"d":"$ 6.00"}},0,{"v":6,"d":"$ 6.00"},{"v":6,"d":"$ 6.00"},"CANCELADO",{"$f":"Tabla1442[[#This Row],[VALOR A PAGAR]]-Tabla1442[[#This Row],[VALOR CANCELADO]]","v":0},{"$f":"Tabla1442[[#This Row],[CANT.]]*2","v":{"v":2,"d":"$ 2.00"}},{"v":4,"d":"$ 4.00"},"GAL'S CON VIGENCIA 2025"]
["2024-11-14","JUVENTUS",1,{"v":6,"d":"$ 6.00"},{"$f":"C86*Tabla1442[[#This Row],[PRECIO UNITARIO]]","v":{"v":6,"d":"$ 6.00"}},{"v":6,"d":"$ 6.00"},0,{"v":6,"d":"$ 6.00"},"CANCELADO",{"$f":"Tabla1442[[#This Row],[VALOR A PAGAR]]-Tabla1442[[#This Row],[VALOR CANCELADO]]","v":0},{"$f":"Tabla1442[[#This Row],[CANT.]]*2","v":{"v":2,"d":"$ 2.00"}},{"v":4,"d":"$ 4.00"},"GAL'S CON VIGENCIA 2025"]
["2024-11-14","TAEKWONDO TRAINING CENTER",4,{"v":8,"d":"$ 8.00"},{"$f":"C87*Tabla1442[[#This Row],[PRECIO UNITARIO]]","v":{"v":32,"d":"$ 32.00"}},0,{"v":32,"d":"$ 32.00"},{"v":32,"d":"$ 32.00"},"CANCELADO",{"$f":"Tabla1442[[#This Row],[VALOR A PAGAR]]-Tabla1442[[#This Row],[VALOR CANCELADO]]","v":0},{"$f":"Tabla1442[[#This Row],[CANT.]]*2","v":{"v":8,"d":"$ 8.00"}},{"v":24,"d":"$ 24.00"},"GAL'S CON VIGENCIA 2025"]
["2024-11-14","TAEKWONDO TRAINING CENTER",8,{"v":6,"d":"$ 6.00"},{"$f":"C88*Tabla1442[[#This Row],[PRECIO UNITARIO]]","v":{"v":48,"d":"$ 48.00"}},0,{"v":48,"d":"$ 48.00"},{"v":48,"d":"$ 48.00"},"CANCELADO",{"$f":"Tabla1442[[#This Row],[VALOR A PAGAR]]-Tabla1442[[#This Row],[VALOR CANCELADO]]","v":0},{"$f":"Tabla1442[[#This Row],[CANT.]]*2","v":{"v":16,"d":"$ 16.00"}},{"v":32,"d":"$ 32.00"},"GAL'S CON VIGENCIA 2025"]
["2024-11-15","ESPE",1,{"v":6,"d":"$ 6.00"},{"$f":"C89*Tabla1442[[#This Row],[PRECIO UNITARIO]]","v":{"v":6,"d":"$ 6.00"}},0,{"v":6,"d":"$ 6.00"},{"v":6,"d":"$ 6.00"},"CANCELADO",{"$f":"Tabla1442[[#This Row],[VALOR A PAGAR]]-Tabla1442[[#This Row],[VALOR CANCELADO]]","v":0},{"$f":"Tabla1442[[#This Row],[CANT.]]*2","v":{"v":2,"d":"$ 2.00"}},{"v":4,"d":"$ 4.00"},"GAL'S CON VIGENCIA 2025"]
["2024-11-15","KUMGANG DUL",3,{"v":6,"d":"$ 6.00"},{"$f":"C90*Tabla1442[[#This Row],[PRECIO UNITARIO]]","v":{"v":18,"d":"$ 18.00"}},0,{"v":18,"d":"$ 18.00"},{"v":18,"d":"$ 18.00"},"CANCELADO",{"$f":"Tabla1442[[#This Row],[VALOR A PAGAR]]-Tabla1442[[#This Row],[VALOR CANCELADO]]","v":0},{"$f":"Tabla1442[[#This Row],[CANT.]]*2","v":{"v":6,"d":"$ 6.00"}},{"v":12,"d":"$ 12.00"},"GAL'S CON VIGENCIA 2025"]
["2024-11-15","KUMGANG DUL",2,{"v":6,"d":"$ 6.00"},{"$f":"C91*Tabla1442[[#This Row],[PRECIO UNITARIO]]","v":{"v":12,"d":"$ 12.00"}},0,{"v":12,"d":"$ 12.00"},{"v":12,"d":"$ 12.00"},"CANCELADO",{"$f":"Tabla1442[[#This Row],[VALOR A PAGAR]]-Tabla1442[[#This Row],[VALOR CANCELADO]]","v":0},{"$f":"Tabla1442[[#This Row],[CANT.]]*2","v":{"v":4,"d":"$ 4.00"}},{"v":8,"d":"$ 8.00"},"GAL'S CON VIGENCIA 2025"]
["2024-11-15","SEUL GEDEON",2,{"v":8,"d":"$ 8.00"},{"$f":"C92*Tabla1442[[#This Row],[PRECIO UNITARIO]]","v":{"v":16,"d":"$ 16.00"}},{"v":16,"d":"$ 16.00"},0,{"v":16,"d":"$ 16.00"},"CANCELADO",{"$f":"Tabla1442[[#This Row],[VALOR A PAGAR]]-Tabla1442[[#This Row],[VALOR CANCELADO]]","v":0},{"$f":"Tabla1442[[#This Row],[CANT.]]*2","v":{"v":4,"d":"$ 4.00"}},{"v":12,"d":"$ 12.00"},"GAL'S CON VIGENCIA 2025"]
["2024-11-15","APOLO",2,{"v":6,"d":"$ 6.00"},{"$f":"C93*Tabla1442[[#This Row],[PRECIO UNITARIO]]","v":{"v":12,"d":"$ 12.00"}},0,{"v":12,"d":"$ 12.00"},{"v":12,"d":"$ 12.00"},"CANCELADO",{"$f":"Tabla1442[[#This Row],[VALOR A PAGAR]]-Tabla1442[[#This Row],[VALOR CANCELADO]]","v":0},{"$f":"Tabla1442[[#This Row],[CANT.]]*2","v":{"v":4,"d":"$ 4.00"}},{"v":8,"d":"$ 8.00"},"GAL'S CON VIGENCIA 2025"]
["2024-11-15","PVM - ROJAS IAN IRON FIST",2,{"v":6,"d":"$ 6.00"},{"$f":"C94*Tabla1442[[#This Row],[PRECIO UNITARIO]]","v":{"v":12,"d":"$ 12.00"}},0,{"v":12,"d":"$ 12.00"},{"v":12,"d":"$ 12.00"},"CANCELADO",{"$f":"Tabla1442[[#This Row],[VALOR A PAGAR]]-Tabla1442[[#This Row],[VALOR CANCELADO]]","v":0},{"$f":"Tabla1442[[#This Row],[CANT.]]*2","v":{"v":4,"d":"$ 4.00"}},{"v":8,"d":"$ 8.00"},"GAL'S CON VIGENCIA 2025"]
["2024-11-15","ILYO M. P.",8,{"v":6,"d":"$ 6.00"},{"$f":"C95*Tabla1442[[#This Row],[PRECIO UNITARIO]]","v":{"v":48,"d":"$ 48.00"}},{"v":48,"d":"$ 48.00"},0,{"v":48,"d":"$ 48.00"},"CANCELADO",{"$f":"Tabla1442[[#This Row],[VALOR A PAGAR]]-Tabla1442[[#This Row],[VALOR CANCELADO]]","v":0},{"$f":"Tabla1442[[#This Row],[CANT.]]*2","v":{"v":16,"d":"$ 16.00"}},{"v":32,"d":"$ 32.00"},"GAL'S CON VIGENCIA 2025"]
["2024-11-19","JOSEON LEGACY",15,{"v":8,"d":"$ 8.00"},{"$f":"C96*Tabla1442[[#This Row],[PRECIO UNITARIO]]","v":{"v":120,"d":"$ 120.00"}},0,{"v":134,"d":"$ 134.00"},{"v":134,"d":"$ 134.00"},"SALDO A FAVOR DEL CLUB",{"$f":"Tabla1442[[#This Row],[VALOR A PAGAR]]-Tabla1442[[#This Row],[VALOR CANCELADO]]","v":{"v":-14,"d":"$ (14.00)"}},{"$f":"Tabla1442[[#This Row],[CANT.]]*2","v":{"v":30,"d":"$ 30.00"}},{"v":90,"d":"$ 90.00"},"SALDO A FAVR DEL CLUB $14"]
["2024-11-19","PALADINS MARCIAL CLUB",2,{"v":8,"d":"$ 8.00"},{"$f":"C97*Tabla1442[[#This Row],[PRECIO UNITARIO]]","v":{"v":16,"d":"$ 16.00"}},0,{"v":16,"d":"$ 16.00"},{"v":16,"d":"$ 16.00"},"CANCELADO",{"$f":"Tabla1442[[#This Row],[VALOR A PAGAR]]-Tabla1442[[#This Row],[VALOR CANCELADO]]","v":0},{"$f":"Tabla1442[[#This Row],[CANT.]]*2","v":{"v":4,"d":"$ 4.00"}},{"v":12,"d":"$ 12.00"},"GAL'S CON VIGENCIA 2025"]
["2024-11-19","GOYANG - IDEUL",1,{"v":8,"d":"$ 8.00"},{"$f":"C98*Tabla1442[[#This Row],[PRECIO UNITARIO]]","v":{"v":8,"d":"$ 8.00"}},0,{"v":8,"d":"$ 8.00"},{"v":8,"d":"$ 8.00"},"CANCELADO",{"$f":"Tabla1442[[#This Row],[VALOR A PAGAR]]-Tabla1442[[#This Row],[VALOR CANCELADO]]","v":0},{"$f":"Tabla1442[[#This Row],[CANT.]]*2","v":{"v":2,"d":"$ 2.00"}},{"v":6,"d":"$ 6.00"},"GAL'S CON VIGENCIA 2025"]
["2024-11-20","SEUL CARAPUNGO",4,{"v":8,"d":"$ 8.00"},{"$f":"C99*Tabla1442[[#This Row],[PRECIO UNITARIO]]","v":{"v":32,"d":"$ 32.00"}},0,{"v":32,"d":"$ 32.00"},{"v":32,"d":"$ 32.00"},"CANCELADO",{"$f":"Tabla1442[[#This Row],[VALOR A PAGAR]]-Tabla1442[[#This Row],[VALOR CANCELADO]]","v":0},{"$f":"Tabla1442[[#This Row],[CANT.]]*2","v":{"v":8,"d":"$ 8.00"}},{"v":24,"d":"$ 24.00"},"GAL'S CON VIGENCIA 2025"]
["2024-11-21","TAE SHO KU (TEAM VALLE)",2,{"v":6,"d":"$ 6.00"},{"$f":"C100*Tabla1442[[#This Row],[PRECIO UNITARIO]]","v":{"v":12,"d":"$ 12.00"}},0,{"v":12,"d":"$ 12.00"},{"$f":"F100+G100","v":{"v":12,"d":"$ 12.00"}},{"$f":"IF((E100=H100),\"CANCELADO\",\"SALDO PENDIENTE\")","v":"CANCELADO"},{"$f":"Tabla1442[[#This Row],[VALOR A PAGAR]]-Tabla1442[[#This Row],[VALOR CANCELADO]]","v":0},{"$f":"Tabla1442[[#This Row],[CANT.]]*2","v":{"v":4,"d":"$ 4.00"}},{"$f":"E100-K100","v":{"v":8,"d":"$ 8.00"}},"GAL'S CON VIGENCIA 2025"]
["2024-11-22","ECUADOR",13,{"v":6,"d":"$ 6.00"},{"$f":"C101*Tabla1442[[#This Row],[PRECIO UNITARIO]]","v":{"v":78,"d":"$ 78.00"}},0,{"v":78,"d":"$ 78.00"},{"v":78,"d":"$ 78.00"},"CANCELADO",{"$f":"Tabla1442[[#This Row],[VALOR A PAGAR]]-Tabla1442[[#This Row],[VALOR CANCELADO]]","v":0},{"$f":"Tabla1442[[#This Row],[CANT.]]*2","v":{"v":26,"d":"$ 26.00"}},{"v":52,"d":"$ 52.00"},"GAL'S CON VIGENCIA 2025"]
["2024-11-25","MARCIAL GRANDA",1,{"v":8,"d":"$ 8.00"},{"$f":"C102*Tabla1442[[#This Row],[PRECIO UNITARIO]]","v":{"v":8,"d":"$ 8.00"}},0,{"v":8,"d":"$ 8.00"},{"v":8,"d":"$ 8.00"},"CANCELADO",{"$f":"Tabla1442[[#This Row],[VALOR A PAGAR]]-Tabla1442[[#This Row],[VALOR CANCELADO]]","v":0},{"$f":"Tabla1442[[#This Row],[CANT.]]*2","v":{"v":2,"d":"$ 2.00"}},{"v":6,"d":"$ 6.00"},"GAL'S CON VIGENCIA 2025"]
["2024-11-26","ILYO M. P.",17,{"v":6,"d":"$ 6.00"},{"$f":"C103*Tabla1442[[#This Row],[PRECIO UNITARIO]]","v":{"v":102,"d":"$ 102.00"}},0,{"v":102,"d":"$ 102.00"},{"v":102,"d":"$ 102.00"},"CANCELADO",{"$f":"Tabla1442[[#This Row],[VALOR A PAGAR]]-Tabla1442[[#This Row],[VALOR CANCELADO]]","v":0},{"$f":"Tabla1442[[#This Row],[CANT.]]*2","v":{"v":34,"d":"$ 34.00"}},{"v":68,"d":"$ 68.00"},"GAL'S CON VIGENCIA 2025"]
["2024-11-26","ASOTKD - P CHIMBACALLE",2,{"v":8,"d":"$ 8.00"},{"$f":"C104*Tabla1442[[#This Row],[PRECIO UNITARIO]]","v":{"v":16,"d":"$ 16.00"}},{"v":16,"d":"$ 16.00"},0,{"v":16,"d":"$ 16.00"},"CANCELADO",{"$f":"Tabla1442[[#This Row],[VALOR A PAGAR]]-Tabla1442[[#This Row],[VALOR CANCELADO]]","v":0},{"$f":"Tabla1442[[#This Row],[CANT.]]*2","v":{"v":4,"d":"$ 4.00"}},{"v":12,"d":"$ 12.00"},"GAL'S CON VIGENCIA 2025"]
["2024-11-27","FITTKWONDO MEJÍA",1,{"v":8,"d":"$ 8.00"},{"$f":"C105*Tabla1442[[#This Row],[PRECIO UNITARIO]]","v":{"v":8,"d":"$ 8.00"}},0,{"v":8,"d":"$ 8.00"},{"v":8,"d":"$ 8.00"},"CANCELADO",{"$f":"Tabla1442[[#This Row],[VALOR A PAGAR]]-Tabla1442[[#This Row],[VALOR CANCELADO]]","v":0},{"$f":"Tabla1442[[#This Row],[CANT.]]*2","v":{"v":2,"d":"$ 2.00"}},{"v":6,"d":"$ 6.00"},"GAL'S CON VIGENCIA 2025"]
["2024-11-28","CIUDAD DE QUITO",2,{"v":8,"d":"$ 8.00"},{"$f":"C106*Tabla1442[[#This Row],[PRECIO UNITARIO]]","v":{"v":16,"d":"$ 16.00"}},0,{"v":16,"d":"$ 16.00"},{"v":16,"d":"$ 16.00"},"CANCELADO",{"$f":"Tabla1442[[#This Row],[VALOR A PAGAR]]-Tabla1442[[#This Row],[VALOR CANCELADO]]","v":0},{"$f":"Tabla1442[[#This Row],[CANT.]]*2","v":{"v":4,"d":"$ 4.00"}},{"v":12,"d":"$ 12.00"},"GAL'S CON VIGENCIA 2025"]
["2024-11-29","TEAM TAURO",32,{"v":8,"d":"$ 8.00"},{"$f":"C107*Tabla1442[[#This Row],[PRECIO UNITARIO]]","v":{"v":256,"d":"$ 256.00"}},0,{"v":256,"d":"$ 256.00"},{"v":256,"d":"$ 256.00"},"CANCELADO",{"$f":"Tabla1442[[#This Row],[VALOR A PAGAR]]-Tabla1442[[#This Row],[VALOR CANCELADO]]","v":0},{"$f":"Tabla1442[[#This Row],[CANT.]]*2","v":{"v":64,"d":"$ 64.00"}},{"v":192,"d":"$ 192.00"},"GAL'S CON VIGENCIA 2025"]
["2024-11-29","HUANG TOP GYM",2,{"v":6,"d":"$ 6.00"},{"$f":"C108*Tabla1442[[#This Row],[PRECIO UNITARIO]]","v":{"v":12,"d":"$ 12.00"}},0,{"v":12,"d":"$ 12.00"},{"v":12,"d":"$ 12.00"},"CANCELADO",{"$f":"Tabla1442[[#This Row],[VALOR A PAGAR]]-Tabla1442[[#This Row],[VALOR CANCELADO]]","v":0},{"$f":"Tabla1442[[#This Row],[CANT.]]*2","v":{"v":4,"d":"$ 4.00"}},{"v":8,"d":"$ 8.00"},"GAL'S CON VIGENCIA 2025"]
["2024-11-29","PYONGYANG",4,{"v":8,"d":"$ 8.00"},{"$f":"C109*Tabla1442[[#This Row],[PRECIO UNITARIO]]","v":{"v":32,"d":"$ 32.00"}},0,{"v":32,"d":"$ 32.00"},{"v":32,"d":"$ 32.00"},"CANCELADO",{"$f":"Tabla1442[[#This Row],[VALOR A PAGAR]]-Tabla1442[[#This Row],[VALOR CANCELADO]]","v":0},{"$f":"Tabla1442[[#This Row],[CANT.]]*2","v":{"v":8,"d":"$ 8.00"}},{"v":24,"d":"$ 24.00"},"GAL'S CON VIGENCIA 2025"]
["2024-12-02","TAEBAEK ECUADOR",2,{"v":8,"d":"$ 8.00"},{"$f":"C110*Tabla1442[[#This Row],[PRECIO UNITARIO]]","v":{"v":16,"d":"$ 16.00"}},0,{"v":16,"d":"$ 16.00"},{"v":16,"d":"$ 16.00"},"CANCELADO",{"$f":"Tabla1442[[#This Row],[VALOR A PAGAR]]-Tabla1442[[#This Row],[VALOR CANCELADO]]","v":0},{"$f":"Tabla1442[[#This Row],[CANT.]]*2","v":{"v":4,"d":"$ 4.00"}},{"v":12,"d":"$ 12.00"},"GAL'S CON VIGENCIA 2025"]
["2024-12-03","ILYO M. P.",1,{"v":6,"d":"$ 6.00"},{"$f":"C111*Tabla1442[[#This Row],[PRECIO UNITARIO]]","v":{"v":6,"d":"$ 6.00"}},0,{"v":6,"d":"$ 6.00"},{"v":6,"d":"$ 6.00"},"CANCELADO",{"$f":"Tabla1442[[#This Row],[VALOR A PAGAR]]-Tabla1442[[#This Row],[VALOR CANCELADO]]","v":0},{"$f":"Tabla1442[[#This Row],[CANT.]]*2","v":{"v":2,"d":"$ 2.00"}},{"v":4,"d":"$ 4.00"},"GAL'S CON VIGENCIA 2025"]
["2024-12-03","SEUL GEDEON",1,{"v":8,"d":"$ 8.00"},{"$f":"C112*Tabla1442[[#This Row],[PRECIO UNITARIO]]","v":{"v":8,"d":"$ 8.00"}},{"v":8,"d":"$ 8.00"},0,{"v":8,"d":"$ 8.00"},"CANCELADO",{"$f":"Tabla1442[[#This Row],[VALOR A PAGAR]]-Tabla1442[[#This Row],[VALOR CANCELADO]]","v":0},{"$f":"Tabla1442[[#This Row],[CANT.]]*2","v":{"v":2,"d":"$ 2.00"}},{"v":6,"d":"$ 6.00"},"GAL'S CON VIGENCIA 2025"]
["2024-12-04","TAEBAEK ECUADOR",1,{"v":8,"d":"$ 8.00"},{"$f":"C113*Tabla1442[[#This Row],[PRECIO UNITARIO]]","v":{"v":8,"d":"$ 8.00"}},0,{"v":8,"d":"$ 8.00"},{"v":8,"d":"$ 8.00"},"CANCELADO",{"$f":"Tabla1442[[#This Row],[VALOR A PAGAR]]-Tabla1442[[#This Row],[VALOR CANCELADO]]","v":0},{"$f":"Tabla1442[[#This Row],[CANT.]]*2","v":{"v":2,"d":"$ 2.00"}},{"v":6,"d":"$ 6.00"},"GAL'S CON VIGENCIA 2025"]
["2024-12-04","SHOGUN",8,{"v":8,"d":"$ 8.00"},{"$f":"C114*Tabla1442[[#This Row],[PRECIO UNITARIO]]","v":{"v":64,"d":"$ 64.00"}},0,{"v":64,"d":"$ 64.00"},{"v":64,"d":"$ 64.00"},"CANCELADO",{"$f":"Tabla1442[[#This Row],[VALOR A PAGAR]]-Tabla1442[[#This Row],[VALOR CANCELADO]]","v":0},{"$f":"Tabla1442[[#This Row],[CANT.]]*2","v":{"v":16,"d":"$ 16.00"}},{"v":48,"d":"$ 48.00"},"GAL'S CON VIGENCIA 2025"]
["2024-12-04","KYORUGUI GYM",4,{"v":8,"d":"$ 8.00"},{"$f":"C115*Tabla1442[[#This Row],[PRECIO UNITARIO]]","v":{"v":32,"d":"$ 32.00"}},0,{"v":32,"d":"$ 32.00"},{"v":32,"d":"$ 32.00"},"CANCELADO",{"$f":"Tabla1442[[#This Row],[VALOR A PAGAR]]-Tabla1442[[#This Row],[VALOR CANCELADO]]","v":0},{"$f":"Tabla1442[[#This Row],[CANT.]]*2","v":{"v":8,"d":"$ 8.00"}},{"v":24,"d":"$ 24.00"},"GAL'S CON VIGENCIA 2025"]
["2024-12-04","TOTAL KOMBAT",26,{"v":6,"d":"$ 6.00"},{"$f":"C116*Tabla1442[[#This Row],[PRECIO UNITARIO]]","v":{"v":156,"d":"$ 156.00"}},0,{"v":156,"d":"$ 156.00"},{"v":156,"d":"$ 156.00"},"CANCELADO",{"$f":"Tabla1442[[#This Row],[VALOR A PAGAR]]-Tabla1442[[#This Row],[VALOR CANCELADO]]","v":0},{"$f":"Tabla1442[[#This Row],[CANT.]]*2","v":{"v":52,"d":"$ 52.00"}},{"v":104,"d":"$ 104.00"},"GAL'S CON VIGENCIA 2025"]
["2024-12-04","TOTAL KOMBAT RHINOS",33,{"v":6,"d":"$ 6.00"},{"$f":"C117*Tabla1442[[#This Row],[PRECIO UNITARIO]]","v":{"v":198,"d":"$ 198.00"}},0,{"v":198,"d":"$ 198.00"},{"v":198,"d":"$ 198.00"},"CANCELADO",{"$f":"Tabla1442[[#This Row],[VALOR A PAGAR]]-Tabla1442[[#This Row],[VALOR CANCELADO]]","v":0},{"$f":"Tabla1442[[#This Row],[CANT.]]*2","v":{"v":66,"d":"$ 66.00"}},{"v":132,"d":"$ 132.00"},"GAL'S CON VIGENCIA 2025"]
["2024-12-04","KO AMÉRICA",74,{"v":6,"d":"$ 6.00"},{"$f":"C118*Tabla1442[[#This Row],[PRECIO UNITARIO]]","v":{"v":444,"d":"$ 444.00"}},0,{"v":444,"d":"$ 444.00"},{"v":444,"d":"$ 444.00"},"CANCELADO",{"$f":"Tabla1442[[#This Row],[VALOR A PAGAR]]-Tabla1442[[#This Row],[VALOR CANCELADO]]","v":0},{"$f":"Tabla1442[[#This Row],[CANT.]]*2","v":{"v":148,"d":"$ 148.00"}},{"v":296,"d":"$ 296.00"},"GAL'S CON VIGENCIA 2025"]
["2024-12-04","BORJA'S LIONS",12,{"v":6,"d":"$ 6.00"},{"$f":"C119*Tabla1442[[#This Row],[PRECIO UNITARIO]]","v":{"v":72,"d":"$ 72.00"}},0,{"v":76,"d":"$ 76.00"},{"v":76,"d":"$ 76.00"},"SALDO A FAVOR DEL CLUB",{"$f":"Tabla1442[[#This Row],[VALOR A PAGAR]]-Tabla1442[[#This Row],[VALOR CANCELADO]]","v":{"v":-4,"d":"$ (4.00)"}},{"$f":"Tabla1442[[#This Row],[CANT.]]*2","v":{"v":24,"d":"$ 24.00"}},{"v":48,"d":"$ 48.00"},"SALDO A FAVOR DEL CLUB $4"]
["2024-12-04","TAE BAEK ECUADOR JR.",8,{"v":8,"d":"$ 8.00"},{"$f":"C120*Tabla1442[[#This Row],[PRECIO UNITARIO]]","v":{"v":64,"d":"$ 64.00"}},0,{"v":64,"d":"$ 64.00"},{"v":64,"d":"$ 64.00"},"CANCELADO",{"$f":"Tabla1442[[#This Row],[VALOR A PAGAR]]-Tabla1442[[#This Row],[VALOR CANCELADO]]","v":0},{"$f":"Tabla1442[[#This Row],[CANT.]]*2","v":{"v":16,"d":"$ 16.00"}},{"v":48,"d":"$ 48.00"},"GAL'S CON VIGENCIA 2025"]
["2024-12-04","TAE BAEK ECUADOR JR.",7,{"v":6,"d":"$ 6.00"},{"$f":"C121*Tabla1442[[#This Row],[PRECIO UNITARIO]]","v":{"v":42,"d":"$ 42.00"}},0,{"v":42,"d":"$ 42.00"},{"v":42,"d":"$ 42.00"},"CANCELADO",{"$f":"Tabla1442[[#This Row],[VALOR A PAGAR]]-Tabla1442[[#This Row],[VALOR CANCELADO]]","v":0},{"$f":"Tabla1442[[#This Row],[CANT.]]*2","v":{"v":14,"d":"$ 14.00"}},{"v":28,"d":"$ 28.00"},"GAL'S CON VIGENCIA 2025"]
["2024-12-04","JI TAE",2,{"v":8,"d":"$ 8.00"},{"$f":"C122*Tabla1442[[#This Row],[PRECIO UNITARIO]]","v":{"v":16,"d":"$ 16.00"}},0,{"v":16,"d":"$ 16.00"},{"v":16,"d":"$ 16.00"},"CANCELADO",{"$f":"Tabla1442[[#This Row],[VALOR A PAGAR]]-Tabla1442[[#This Row],[VALOR CANCELADO]]","v":0},{"$f":"Tabla1442[[#This Row],[CANT.]]*2","v":{"v":4,"d":"$ 4.00"}},{"v":12,"d":"$ 12.00"},"GAL'S CON VIGENCIA 2025"]
["2024-12-04","SIMJANG",2,{"v":8,"d":"$ 8.00"},{"$f":"C123*Tabla1442[[#This Row],[PRECIO UNITARIO]]","v":{"v":16,"d":"$ 16.00"}},0,{"v":16,"d":"$ 16.00"},{"v":16,"d":"$ 16.00"},"CANCELADO",{"$f":"Tabla1442[[#This Row],[VALOR A PAGAR]]-Tabla1442[[#This Row],[VALOR CANCELADO]]","v":0},{"$f":"Tabla1442[[#This Row],[CANT.]]*2","v":{"v":4,"d":"$ 4.00"}},{"v":12,"d":"$ 12.00"},"GAL'S CON VIGENCIA 2025"]
["2024-12-04","TAE WOONG",9,{"v":6,"d":"$ 6.00"},{"$f":"C124*Tabla1442[[#This Row],[PRECIO UNITARIO]]","v":{"v":54,"d":"$ 54.00"}},0,{"v":54,"d":"$ 54.00"},{"v":54,"d":"$ 54.00"},"CANCELADO",{"$f":"Tabla1442[[#This Row],[VALOR A PAGAR]]-Tabla1442[[#This Row],[VALOR CANCELADO]]","v":0},{"$f":"Tabla1442[[#This Row],[CANT.]]*2","v":{"v":18,"d":"$ 18.00"}},{"v":36,"d":"$ 36.00"},"GAL'S CON VIGENCIA 2025"]
["2024-12-04","KUMGANG DUL",1,{"v":8,"d":"$ 8.00"},{"$f":"C125*Tabla1442[[#This Row],[PRECIO UNITARIO]]","v":{"v":8,"d":"$ 8.00"}},0,{"v":8,"d":"$ 8.00"},{"v":8,"d":"$ 8.00"},"CANCELADO",{"$f":"Tabla1442[[#This Row],[VALOR A PAGAR]]-Tabla1442[[#This Row],[VALOR CANCELADO]]","v":0},{"$f":"Tabla1442[[#This Row],[CANT.]]*2","v":{"v":2,"d":"$ 2.00"}},{"v":6,"d":"$ 6.00"},"GAL'S CON VIGENCIA 2025"]
["2024-12-04","KUMGANG DUL",1,{"v":8,"d":"$ 8.00"},{"$f":"C126*Tabla1442[[#This Row],[PRECIO UNITARIO]]","v":{"v":8,"d":"$ 8.00"}},0,{"v":8,"d":"$ 8.00"},{"v":8,"d":"$ 8.00"},"CANCELADO",{"$f":"Tabla1442[[#This Row],[VALOR A PAGAR]]-Tabla1442[[#This Row],[VALOR CANCELADO]]","v":0},{"$f":"Tabla1442[[#This Row],[CANT.]]*2","v":{"v":2,"d":"$ 2.00"}},{"v":6,"d":"$ 6.00"},"GAL'S CON VIGENCIA 2025"]
["2024-12-04","DRAGON LEE GYM",2,{"v":8,"d":"$ 8.00"},{"$f":"C127*Tabla1442[[#This Row],[PRECIO UNITARIO]]","v":{"v":16,"d":"$ 16.00"}},0,{"v":16,"d":"$ 16.00"},{"v":16,"d":"$ 16.00"},"CANCELADO",{"$f":"Tabla1442[[#This Row],[VALOR A PAGAR]]-Tabla1442[[#This Row],[VALOR CANCELADO]]","v":0},{"$f":"Tabla1442[[#This Row],[CANT.]]*2","v":{"v":4,"d":"$ 4.00"}},{"v":12,"d":"$ 12.00"},"GAL'S CON VIGENCIA 2025"]
["2024-12-05","KUMGANG DUL",1,{"v":8,"d":"$ 8.00"},{"$f":"C128*Tabla1442[[#This Row],[PRECIO UNITARIO]]","v":{"v":8,"d":"$ 8.00"}},0,{"v":8,"d":"$ 8.00"},{"v":8,"d":"$ 8.00"},"CANCELADO",{"$f":"Tabla1442[[#This Row],[VALOR A PAGAR]]-Tabla1442[[#This Row],[VALOR CANCELADO]]","v":0},{"$f":"Tabla1442[[#This Row],[CANT.]]*2","v":{"v":2,"d":"$ 2.00"}},{"v":6,"d":"$ 6.00"},"GAL'S CON VIGENCIA 2025"]
["2024-12-05","KOREAN DRAGON",1,{"v":8,"d":"$ 8.00"},{"$f":"C129*Tabla1442[[#This Row],[PRECIO UNITARIO]]","v":{"v":8,"d":"$ 8.00"}},0,{"v":8,"d":"$ 8.00"},{"v":8,"d":"$ 8.00"},"CANCELADO",{"$f":"Tabla1442[[#This Row],[VALOR A PAGAR]]-Tabla1442[[#This Row],[VALOR CANCELADO]]","v":0},{"$f":"Tabla1442[[#This Row],[CANT.]]*2","v":{"v":2,"d":"$ 2.00"}},{"v":6,"d":"$ 6.00"},"GAL'S CON VIGENCIA 2025"]
["2024-12-05","KOREAN DRAGON",2,{"v":6,"d":"$ 6.00"},{"$f":"C130*Tabla1442[[#This Row],[PRECIO UNITARIO]]","v":{"v":12,"d":"$ 12.00"}},0,{"v":12,"d":"$ 12.00"},{"v":12,"d":"$ 12.00"},"CANCELADO",{"$f":"Tabla1442[[#This Row],[VALOR A PAGAR]]-Tabla1442[[#This Row],[VALOR CANCELADO]]","v":0},{"$f":"Tabla1442[[#This Row],[CANT.]]*2","v":{"v":4,"d":"$ 4.00"}},{"v":8,"d":"$ 8.00"},"GAL'S CON VIGENCIA 2025"]
["2024-12-05","ASOTKD - P CHIMBACALLE",4,{"v":8,"d":"$ 8.00"},{"$f":"C131*Tabla1442[[#This Row],[PRECIO UNITARIO]]","v":{"v":32,"d":"$ 32.00"}},{"v":32,"d":"$ 32.00"},0,{"v":32,"d":"$ 32.00"},"CANCELADO",{"$f":"Tabla1442[[#This Row],[VALOR A PAGAR]]-Tabla1442[[#This Row],[VALOR CANCELADO]]","v":0},{"$f":"Tabla1442[[#This Row],[CANT.]]*2","v":{"v":8,"d":"$ 8.00"}},{"v":24,"d":"$ 24.00"},"GAL'S CON VIGENCIA 2025"]
["2024-12-05","MERCENARIOS",4,{"v":6,"d":"$ 6.00"},{"$f":"C132*Tabla1442[[#This Row],[PRECIO UNITARIO]]","v":{"v":24,"d":"$ 24.00"}},0,{"v":24,"d":"$ 24.00"},{"$f":"F132+G132","v":{"v":24,"d":"$ 24.00"}},{"$f":"IF((E132=H132),\"CANCELADO\",\"SALDO PENDIENTE\")","v":"CANCELADO"},{"$f":"Tabla1442[[#This Row],[VALOR A PAGAR]]-Tabla1442[[#This Row],[VALOR CANCELADO]]","v":0},{"$f":"Tabla1442[[#This Row],[CANT.]]*2","v":{"v":8,"d":"$ 8.00"}},{"$f":"E132-K132","v":{"v":16,"d":"$ 16.00"}},"GAL'S CON VIGENCIA 2025"]
["2024-12-05","TAE KING'S",2,{"v":6,"d":"$ 6.00"},{"$f":"C133*Tabla1442[[#This Row],[PRECIO UNITARIO]]","v":{"v":12,"d":"$ 12.00"}},0,{"v":12,"d":"$ 12.00"},{"v":12,"d":"$ 12.00"},"CANCELADO",{"$f":"Tabla1442[[#This Row],[VALOR A PAGAR]]-Tabla1442[[#This Row],[VALOR CANCELADO]]","v":0},{"$f":"Tabla1442[[#This Row],[CANT.]]*2","v":{"v":4,"d":"$ 4.00"}},{"v":8,"d":"$ 8.00"},"GAL'S CON VIGENCIA 2025"]
["2024-12-05","DECIAP",11,{"v":6,"d":"$ 6.00"},{"$f":"C134*Tabla1442[[#This Row],[PRECIO UNITARIO]]","v":{"v":66,"d":"$ 66.00"}},0,{"v":66,"d":"$ 66.00"},{"v":66,"d":"$ 66.00"},"CANCELADO",{"$f":"Tabla1442[[#This Row],[VALOR A PAGAR]]-Tabla1442[[#This Row],[VALOR CANCELADO]]","v":0},{"$f":"Tabla1442[[#This Row],[CANT.]]*2","v":{"v":22,"d":"$ 22.00"}},{"v":44,"d":"$ 44.00"},"GAL'S CON VIGENCIA 2025"]
["2024-12-05","SEUL CHUNG UI",4,{"v":8,"d":"$ 8.00"},{"$f":"C135*Tabla1442[[#This Row],[PRECIO UNITARIO]]","v":{"v":32,"d":"$ 32.00"}},0,{"v":32,"d":"$ 32.00"},{"v":32,"d":"$ 32.00"},"CANCELADO",{"$f":"Tabla1442[[#This Row],[VALOR A PAGAR]]-Tabla1442[[#This Row],[VALOR CANCELADO]]","v":0},{"$f":"Tabla1442[[#This Row],[CANT.]]*2","v":{"v":8,"d":"$ 8.00"}},{"v":24,"d":"$ 24.00"},"GAL'S CON VIGENCIA 2025"]
["2024-12-05","TAE DO ACADEMY",1,{"v":6,"d":"$ 6.00"},{"$f":"C136*Tabla1442[[#This Row],[PRECIO UNITARIO]]","v":{"v":6,"d":"$ 6.00"}},0,{"v":6,"d":"$ 6.00"},{"v":6,"d":"$ 6.00"},"CANCELADO",{"$f":"Tabla1442[[#This Row],[VALOR A PAGAR]]-Tabla1442[[#This Row],[VALOR CANCELADO]]","v":0},{"$f":"Tabla1442[[#This Row],[CANT.]]*2","v":{"v":2,"d":"$ 2.00"}},{"v":4,"d":"$ 4.00"},"GAL'S CON VIGENCIA 2025"]
["2024-12-05","TAE SHO KU",4,{"v":8,"d":"$ 8.00"},{"$f":"C137*Tabla1442[[#This Row],[PRECIO UNITARIO]]","v":{"v":32,"d":"$ 32.00"}},0,{"v":32,"d":"$ 32.00"},{"v":32,"d":"$ 32.00"},"CANCELADO",{"$f":"Tabla1442[[#This Row],[VALOR A PAGAR]]-Tabla1442[[#This Row],[VALOR CANCELADO]]","v":0},{"$f":"Tabla1442[[#This Row],[CANT.]]*2","v":{"v":8,"d":"$ 8.00"}},{"v":24,"d":"$ 24.00"},"GAL'S CON VIGENCIA 2025"]
["2024-12-05","CAMU",22,{"v":8,"d":"$ 8.00"},{"$f":"C138*Tabla1442[[#This Row],[PRECIO UNITARIO]]","v":{"v":176,"d":"$ 176.00"}},0,{"v":176,"d":"$ 176.00"},{"v":176,"d":"$ 176.00"},"CANCELADO",{"$f":"Tabla1442[[#This Row],[VALOR A PAGAR]]-Tabla1442[[#This Row],[VALOR CANCELADO]]","v":0},{"$f":"Tabla1442[[#This Row],[CANT.]]*2","v":{"v":44,"d":"$ 44.00"}},{"v":132,"d":"$ 132.00"},"GAL'S CON VIGENCIA 2025"]
["2024-12-05","ARES",2,{"v":6,"d":"$ 6.00"},{"$f":"C139*Tabla1442[[#This Row],[PRECIO UNITARIO]]","v":{"v":12,"d":"$ 12.00"}},0,{"v":12,"d":"$ 12.00"},{"v":12,"d":"$ 12.00"},"CANCELADO",{"$f":"Tabla1442[[#This Row],[VALOR A PAGAR]]-Tabla1442[[#This Row],[VALOR CANCELADO]]","v":0},{"$f":"Tabla1442[[#This Row],[CANT.]]*2","v":{"v":4,"d":"$ 4.00"}},{"v":8,"d":"$ 8.00"},"GAL'S CON VIGENCIA 2025"]
["2024-12-05","ARES",8,{"v":8,"d":"$ 8.00"},{"$f":"C140*Tabla1442[[#This Row],[PRECIO UNITARIO]]","v":{"v":64,"d":"$ 64.00"}},0,{"v":64,"d":"$ 64.00"},{"v":64,"d":"$ 64.00"},"CANCELADO",{"$f":"Tabla1442[[#This Row],[VALOR A PAGAR]]-Tabla1442[[#This Row],[VALOR CANCELADO]]","v":0},{"$f":"Tabla1442[[#This Row],[CANT.]]*2","v":{"v":16,"d":"$ 16.00"}},{"v":48,"d":"$ 48.00"},"GAL'S CON VIGENCIA 2025"]
["2024-12-06","KORYO",3,{"v":6,"d":"$ 6.00"},{"$f":"C141*Tabla1442[[#This Row],[PRECIO UNITARIO]]","v":{"v":18,"d":"$ 18.00"}},0,{"v":18,"d":"$ 18.00"},{"v":18,"d":"$ 18.00"},"CANCELADO",{"$f":"Tabla1442[[#This Row],[VALOR A PAGAR]]-Tabla1442[[#This Row],[VALOR CANCELADO]]","v":0},{"$f":"Tabla1442[[#This Row],[CANT.]]*2","v":{"v":6,"d":"$ 6.00"}},{"v":12,"d":"$ 12.00"},"GAL'S CON VIGENCIA 2025"]
["2024-12-06","HANSU CAYAMBE",1,{"v":8,"d":"$ 8.00"},{"$f":"C142*Tabla1442[[#This Row],[PRECIO UNITARIO]]","v":{"v":8,"d":"$ 8.00"}},0,{"v":8,"d":"$ 8.00"},{"v":8,"d":"$ 8.00"},"CANCELADO",{"$f":"Tabla1442[[#This Row],[VALOR A PAGAR]]-Tabla1442[[#This Row],[VALOR CANCELADO]]","v":0},{"$f":"Tabla1442[[#This Row],[CANT.]]*2","v":{"v":2,"d":"$ 2.00"}},{"v":6,"d":"$ 6.00"},"GAL'S CON VIGENCIA 2025"]
["2024-12-06","KO AMÉRICA",2,{"v":6,"d":"$ 6.00"},{"$f":"C143*Tabla1442[[#This Row],[PRECIO UNITARIO]]","v":{"v":12,"d":"$ 12.00"}},0,{"v":12,"d":"$ 12.00"},{"v":12,"d":"$ 12.00"},"CANCELADO",{"$f":"Tabla1442[[#This Row],[VALOR A PAGAR]]-Tabla1442[[#This Row],[VALOR CANCELADO]]","v":0},{"$f":"Tabla1442[[#This Row],[CANT.]]*2","v":{"v":4,"d":"$ 4.00"}},{"v":8,"d":"$ 8.00"},"GAL'S CON VIGENCIA 2025"]
["2024-12-07","SEUL",1,{"v":6,"d":"$ 6.00"},{"$f":"C144*Tabla1442[[#This Row],[PRECIO UNITARIO]]","v":{"v":6,"d":"$ 6.00"}},0,{"v":6,"d":"$ 6.00"},{"v":6,"d":"$ 6.00"},"CANCELADO",{"$f":"Tabla1442[[#This Row],[VALOR A PAGAR]]-Tabla1442[[#This Row],[VALOR CANCELADO]]","v":0},{"$f":"Tabla1442[[#This Row],[CANT.]]*2","v":{"v":2,"d":"$ 2.00"}},{"v":4,"d":"$ 4.00"},"GAL'S CON VIGENCIA 2025"]
["2024-12-08","BAEKJUL",12,{"v":6,"d":"$ 6.00"},{"$f":"C145*Tabla1442[[#This Row],[PRECIO UNITARIO]]","v":{"v":72,"d":"$ 72.00"}},0,{"v":72,"d":"$ 72.00"},{"v":72,"d":"$ 72.00"},"CANCELADO",{"$f":"Tabla1442[[#This Row],[VALOR A PAGAR]]-Tabla1442[[#This Row],[VALOR CANCELADO]]","v":0},{"$f":"Tabla1442[[#This Row],[CANT.]]*2","v":{"v":24,"d":"$ 24.00"}},{"v":48,"d":"$ 48.00"},"PAGO EN EVENTO / GAL'S CON VIGENCIA 2025"]
["2024-12-08","FIRST CLASS",1,{"v":8,"d":"$ 8.00"},{"$f":"C146*Tabla1442[[#This Row],[PRECIO UNITARIO]]","v":{"v":8,"d":"$ 8.00"}},0,{"v":8,"d":"$ 8.00"},{"v":8,"d":"$ 8.00"},"CANCELADO",{"$f":"Tabla1442[[#This Row],[VALOR A PAGAR]]-Tabla1442[[#This Row],[VALOR CANCELADO]]","v":0},{"$f":"Tabla1442[[#This Row],[CANT.]]*2","v":{"v":2,"d":"$ 2.00"}},{"v":6,"d":"$ 6.00"},"PAGO EN EVENTO / GAL'S CON VIGENCIA 2025"]
["2024-12-08","FURIA NEGRA",3,{"v":8,"d":"$ 8.00"},{"$f":"C147*Tabla1442[[#This Row],[PRECIO UNITARIO]]","v":{"v":24,"d":"$ 24.00"}},0,{"v":24,"d":"$ 24.00"},{"v":24,"d":"$ 24.00"},"CANCELADO",{"$f":"Tabla1442[[#This Row],[VALOR A PAGAR]]-Tabla1442[[#This Row],[VALOR CANCELADO]]","v":0},{"$f":"Tabla1442[[#This Row],[CANT.]]*2","v":{"v":6,"d":"$ 6.00"}},{"v":18,"d":"$ 18.00"},"PAGO EN EVENTO / GAL'S CON VIGENCIA 2025"]
["2024-12-08","HUANG TOP GYM",1,{"v":8,"d":"$ 8.00"},{"$f":"C148*Tabla1442[[#This Row],[PRECIO UNITARIO]]","v":{"v":8,"d":"$ 8.00"}},0,{"v":8,"d":"$ 8.00"},{"v":8,"d":"$ 8.00"},"CANCELADO",{"$f":"Tabla1442[[#This Row],[VALOR A PAGAR]]-Tabla1442[[#This Row],[VALOR CANCELADO]]","v":0},{"$f":"Tabla1442[[#This Row],[CANT.]]*2","v":{"v":2,"d":"$ 2.00"}},{"v":6,"d":"$ 6.00"},"PAGO EN EVENTO / GAL'S CON VIGENCIA 2025"]
["2024-12-08","JIDOKWAN",1,{"v":6,"d":"$ 6.00"},{"$f":"C149*Tabla1442[[#This Row],[PRECIO UNITARIO]]","v":{"v":6,"d":"$ 6.00"}},0,{"v":6,"d":"$ 6.00"},{"v":6,"d":"$ 6.00"},"CANCELADO",{"$f":"Tabla1442[[#This Row],[VALOR A PAGAR]]-Tabla1442[[#This Row],[VALOR CANCELADO]]","v":0},{"$f":"Tabla1442[[#This Row],[CANT.]]*2","v":{"v":2,"d":"$ 2.00"}},{"v":4,"d":"$ 4.00"},"PAGO EN EVENTO / GAL'S CON VIGENCIA 2025"]
["2024-12-08","SAN SEBASTIÁN",3,{"v":8,"d":"$ 8.00"},{"$f":"C150*Tabla1442[[#This Row],[PRECIO UNITARIO]]","v":{"v":24,"d":"$ 24.00"}},0,{"v":24,"d":"$ 24.00"},{"v":24,"d":"$ 24.00"},"CANCELADO",{"$f":"Tabla1442[[#This Row],[VALOR A PAGAR]]-Tabla1442[[#This Row],[VALOR CANCELADO]]","v":0},{"$f":"Tabla1442[[#This Row],[CANT.]]*2","v":{"v":6,"d":"$ 6.00"}},{"v":18,"d":"$ 18.00"},"PAGO EN EVENTO / GAL'S CON VIGENCIA 2025"]
["2024-12-08","SAN SEBASTIÁN",1,{"v":6,"d":"$ 6.00"},{"$f":"C151*Tabla1442[[#This Row],[PRECIO UNITARIO]]","v":{"v":6,"d":"$ 6.00"}},0,{"v":6,"d":"$ 6.00"},{"v":6,"d":"$ 6.00"},"CANCELADO",{"$f":"Tabla1442[[#This Row],[VALOR A PAGAR]]-Tabla1442[[#This Row],[VALOR CANCELADO]]","v":0},{"$f":"Tabla1442[[#This Row],[CANT.]]*2","v":{"v":2,"d":"$ 2.00"}},{"v":4,"d":"$ 4.00"},"PAGO EN EVENTO / GAL'S CON VIGENCIA 2025"]
["2024-12-08","SHOGUN",1,{"v":8,"d":"$ 8.00"},{"$f":"C152*Tabla1442[[#This Row],[PRECIO UNITARIO]]","v":{"v":8,"d":"$ 8.00"}},0,{"v":8,"d":"$ 8.00"},{"v":8,"d":"$ 8.00"},"CANCELADO",{"$f":"Tabla1442[[#This Row],[VALOR A PAGAR]]-Tabla1442[[#This Row],[VALOR CANCELADO]]","v":0},{"$f":"Tabla1442[[#This Row],[CANT.]]*2","v":{"v":2,"d":"$ 2.00"}},{"v":6,"d":"$ 6.00"},"PAGO EN EVENTO / GAL'S CON VIGENCIA 2025"]
["2024-12-08","SOCIEDAD DEPORTIVA CENTRAL",21,{"v":6,"d":"$ 6.00"},{"$f":"C153*Tabla1442[[#This Row],[PRECIO UNITARIO]]","v":{"v":126,"d":"$ 126.00"}},0,{"v":126,"d":"$ 126.00"},{"$f":"F153+G153","v":{"v":126,"d":"$ 126.00"}},{"$f":"IF((E153=H153),\"CANCELADO\",\"SALDO PENDIENTE\")","v":"CANCELADO"},{"$f":"Tabla1442[[#This Row],[VALOR A PAGAR]]-Tabla1442[[#This Row],[VALOR CANCELADO]]","v":0},{"$f":"Tabla1442[[#This Row],[CANT.]]*2","v":{"v":42,"d":"$ 42.00"}},{"$f":"E153-K153","v":{"v":84,"d":"$ 84.00"}},"PAGO EN EVENTO / GAL'S CON VIGENCIA 2025"]
["2024-12-08","YONG TIGER",2,{"v":8,"d":"$ 8.00"},{"$f":"C154*Tabla1442[[#This Row],[PRECIO UNITARIO]]","v":{"v":16,"d":"$ 16.00"}},0,{"v":16,"d":"$ 16.00"},{"$f":"F154+G154","v":{"v":16,"d":"$ 16.00"}},{"$f":"IF((E154=H154),\"CANCELADO\",\"SALDO PENDIENTE\")","v":"CANCELADO"},{"$f":"Tabla1442[[#This Row],[VALOR A PAGAR]]-Tabla1442[[#This Row],[VALOR CANCELADO]]","v":0},{"$f":"Tabla1442[[#This Row],[CANT.]]*2","v":{"v":4,"d":"$ 4.00"}},{"$f":"E154-K154","v":{"v":12,"d":"$ 12.00"}},"PAGO EN EVENTO / GAL'S CON VIGENCIA 2025"]
["2024-12-08","YONG TIGER",4,{"v":6,"d":"$ 6.00"},{"$f":"C155*Tabla1442[[#This Row],[PRECIO UNITARIO]]","v":{"v":24,"d":"$ 24.00"}},0,{"v":24,"d":"$ 24.00"},{"$f":"F155+G155","v":{"v":24,"d":"$ 24.00"}},{"$f":"IF((E155=H155),\"CANCELADO\",\"SALDO PENDIENTE\")","v":"CANCELADO"},{"$f":"Tabla1442[[#This Row],[VALOR A PAGAR]]-Tabla1442[[#This Row],[VALOR CANCELADO]]","v":0},{"$f":"Tabla1442[[#This Row],[CANT.]]*2","v":{"v":8,"d":"$ 8.00"}},{"$f":"E155-K155","v":{"v":16,"d":"$ 16.00"}},"PAGO EN EVENTO / GAL'S CON VIGENCIA 2025"]
["2024-12-09","TKT - KUKKIWON - C.C",4,{"v":6,"d":"$ 6.00"},{"$f":"C156*Tabla1442[[#This Row],[PRECIO UNITARIO]]","v":{"v":24,"d":"$ 24.00"}},0,{"v":24,"d":"$ 24.00"},{"v":24,"d":"$ 24.00"},"CANCELADO",{"$f":"Tabla1442[[#This Row],[VALOR A PAGAR]]-Tabla1442[[#This Row],[VALOR CANCELADO]]","v":0},{"$f":"Tabla1442[[#This Row],[CANT.]]*2","v":{"v":8,"d":"$ 8.00"}},{"v":16,"d":"$ 16.00"},"GAL'S CON VIGENCIA 2025"]
["2024-12-09","DRACO",11,{"v":6,"d":"$ 6.00"},{"$f":"C157*Tabla1442[[#This Row],[PRECIO UNITARIO]]","v":{"v":66,"d":"$ 66.00"}},0,{"v":66,"d":"$ 66.00"},{"v":66,"d":"$ 66.00"},"CANCELADO",{"$f":"Tabla1442[[#This Row],[VALOR A PAGAR]]-Tabla1442[[#This Row],[VALOR CANCELADO]]","v":0},{"$f":"Tabla1442[[#This Row],[CANT.]]*2","v":{"v":22,"d":"$ 22.00"}},{"v":44,"d":"$ 44.00"},"GAL'S CON VIGENCIA 2025"]
["2024-12-09","CHAMPIONS FOR LIFE",2,{"v":6,"d":"$ 6.00"},{"$f":"C158*Tabla1442[[#This Row],[PRECIO UNITARIO]]","v":{"v":12,"d":"$ 12.00"}},0,{"v":12,"d":"$ 12.00"},{"v":12,"d":"$ 12.00"},"CANCELADO",{"$f":"Tabla1442[[#This Row],[VALOR A PAGAR]]-Tabla1442[[#This Row],[VALOR CANCELADO]]","v":0},{"$f":"Tabla1442[[#This Row],[CANT.]]*2","v":{"v":4,"d":"$ 4.00"}},{"v":8,"d":"$ 8.00"},"PAGO EN EVENTO / GAL'S CON VIGENCIA 2025"]
["2024-12-09","RAIG DE LLUM",16,{"v":8,"d":"$ 8.00"},{"$f":"C159*Tabla1442[[#This Row],[PRECIO UNITARIO]]","v":{"v":128,"d":"$ 128.00"}},0,{"v":128,"d":"$ 128.00"},{"$f":"F159+G159","v":{"v":128,"d":"$ 128.00"}},{"$f":"IF((E159=H159),\"CANCELADO\",\"SALDO PENDIENTE\")","v":"CANCELADO"},{"$f":"Tabla1442[[#This Row],[VALOR A PAGAR]]-Tabla1442[[#This Row],[VALOR CANCELADO]]","v":0},{"$f":"Tabla1442[[#This Row],[CANT.]]*2","v":{"v":32,"d":"$ 32.00"}},{"$f":"E159-K159","v":{"v":96,"d":"$ 96.00"}},"GAL'S CON VIGENCIA 2025"]
["2025-12-10","SHOGUN",3,{"v":6,"d":"$ 6.00"},{"$f":"C160*Tabla1442[[#This Row],[PRECIO UNITARIO]]","v":{"v":18,"d":"$ 18.00"}},0,{"v":18,"d":"$ 18.00"},{"$f":"F160+G160","v":{"v":18,"d":"$ 18.00"}},{"$f":"IF((E160=H160),\"CANCELADO\",\"SALDO PENDIENTE\")","v":"CANCELADO"},{"$f":"Tabla1442[[#This Row],[VALOR A PAGAR]]-Tabla1442[[#This Row],[VALOR CANCELADO]]","v":0},{"$f":"Tabla1442[[#This Row],[CANT.]]*2","v":{"v":6,"d":"$ 6.00"}},{"$f":"E160-K160","v":{"v":12,"d":"$ 12.00"}},"GAL'S CON VIGENCIA 2025"]
["2025-12-10","LEÓN",6,{"v":6,"d":"$ 6.00"},{"$f":"C161*Tabla1442[[#This Row],[PRECIO UNITARIO]]","v":{"v":36,"d":"$ 36.00"}},0,{"v":36,"d":"$ 36.00"},{"$f":"F161+G161","v":{"v":36,"d":"$ 36.00"}},{"$f":"IF((E161=H161),\"CANCELADO\",\"SALDO PENDIENTE\")","v":"CANCELADO"},{"$f":"Tabla1442[[#This Row],[VALOR A PAGAR]]-Tabla1442[[#This Row],[VALOR CANCELADO]]","v":0},{"$f":"Tabla1442[[#This Row],[CANT.]]*2","v":{"v":12,"d":"$ 12.00"}},{"$f":"E161-K161","v":{"v":24,"d":"$ 24.00"}},"GAL'S CON VIGENCIA 2025"]
["2024-12-11","YONG TIGER",4,{"v":6,"d":"$ 6.00"},{"$f":"C162*Tabla1442[[#This Row],[PRECIO UNITARIO]]","v":{"v":24,"d":"$ 24.00"}},0,{"v":24,"d":"$ 24.00"},{"v":24,"d":"$ 24.00"},"CANCELADO",{"$f":"Tabla1442[[#This Row],[VALOR A PAGAR]]-Tabla1442[[#This Row],[VALOR CANCELADO]]","v":0},{"$f":"Tabla1442[[#This Row],[CANT.]]*2","v":{"v":8,"d":"$ 8.00"}},{"v":16,"d":"$ 16.00"},"GAL'S CON VIGENCIA 2025"]
["2024-12-11","YONG TIGER",10,{"v":6,"d":"$ 6.00"},{"$f":"C163*Tabla1442[[#This Row],[PRECIO UNITARIO]]","v":{"v":60,"d":"$ 60.00"}},0,{"v":60,"d":"$ 60.00"},{"v":60,"d":"$ 60.00"},"CANCELADO",{"$f":"Tabla1442[[#This Row],[VALOR A PAGAR]]-Tabla1442[[#This Row],[VALOR CANCELADO]]","v":0},{"$f":"Tabla1442[[#This Row],[CANT.]]*2","v":{"v":20,"d":"$ 20.00"}},{"v":40,"d":"$ 40.00"},"GAL'S CON VIGENCIA 2025"]
["2024-12-12","TAE WOONG",3,{"v":6,"d":"$ 6.00"},{"$f":"C164*Tabla1442[[#This Row],[PRECIO UNITARIO]]","v":{"v":18,"d":"$ 18.00"}},0,{"v":18,"d":"$ 18.00"},{"v":18,"d":"$ 18.00"},"CANCELADO",{"$f":"Tabla1442[[#This Row],[VALOR A PAGAR]]-Tabla1442[[#This Row],[VALOR CANCELADO]]","v":0},{"$f":"Tabla1442[[#This Row],[CANT.]]*2","v":{"v":6,"d":"$ 6.00"}},{"v":12,"d":"$ 12.00"},"GAL'S CON VIGENCIA 2025"]
["2024-12-12","KOREAN DRAGON",1,{"v":6,"d":"$ 6.00"},{"$f":"C165*Tabla1442[[#This Row],[PRECIO UNITARIO]]","v":{"v":6,"d":"$ 6.00"}},0,{"v":6,"d":"$ 6.00"},{"v":6,"d":"$ 6.00"},"CANCELADO",{"$f":"Tabla1442[[#This Row],[VALOR A PAGAR]]-Tabla1442[[#This Row],[VALOR CANCELADO]]","v":0},{"$f":"Tabla1442[[#This Row],[CANT.]]*2","v":{"v":2,"d":"$ 2.00"}},{"v":4,"d":"$ 4.00"},"GAL'S CON VIGENCIA 2025"]
["2024-12-13","ARES",1,{"v":8,"d":"$ 8.00"},{"$f":"C166*Tabla1442[[#This Row],[PRECIO UNITARIO]]","v":{"v":8,"d":"$ 8.00"}},0,{"v":8,"d":"$ 8.00"},{"v":8,"d":"$ 8.00"},"CANCELADO",{"$f":"Tabla1442[[#This Row],[VALOR A PAGAR]]-Tabla1442[[#This Row],[VALOR CANCELADO]]","v":0},{"$f":"Tabla1442[[#This Row],[CANT.]]*2","v":{"v":2,"d":"$ 2.00"}},{"v":6,"d":"$ 6.00"},"GAL'S CON VIGENCIA 2025"]
[null,"TOTAL",{"$f":"SUM(C4:C166)","v":878},null,{"$f":"SUBTOTAL(109,Tabla1442[VALOR A PAGAR])","v":{"v":5820,"d":"$5,820.00"}},{"$f":"SUM(F4:F166)","v":{"v":332,"d":"$332.00"}},{"$f":"SUM(G4:G166)","v":{"v":5506,"d":"$5,506.00"}},{"$f":"SUM(H4:H166)","v":{"v":5838,"d":"$5,838.00"}}]
[null,null,"GAL ELABORADOS",null,"A RECAUDARSE","RECAUDADO EN EFECTIVO","RECAUDADO EN TRANSFERENCIA"]
[]
[]
[null,"RECAUDADO","MONTO"]
[null,"EFECTIVO",{"$f":"F167","v":{"v":332,"d":"$332.00"}}]
[null,"TRANSFERENCIA",{"$f":"G167","v":{"v":5506,"d":"$5,506.00"}}]
[null,"TOTAL",{"$f":"SUM(C172:C173)","v":{"v":5838,"d":"$5,838.00"}}]
[]
[]
[null,"POR COBRAR","MONTO"]
[]
[null,"TOTAL",{"$f":"SUM(C178:C178)","v":{"v":0,"d":"$0.00"}}]
[]
[]
[null,"DEVOLVER O HACER PASO","MONTO"]
[null,{"$f":"B96","v":"JOSEON LEGACY"},{"v":14,"d":"$14.00"}]
[null,{"$f":"B119","v":"BORJA'S LIONS"},{"v":4,"d":"$4.00"}]
[null,"TOTAL",{"$f":"SUM(C183:C184)","v":{"v":18,"d":"$18.00"}}]
{"$rows_empty":1353}
[null,null,"BENJAMIN MATIAS "]

{"sheet":"GAL'S 2025 ","index":4,"n_rows":1520,"n_cols":13,"rows_kept":1520,"merged":[[0,5,0,6],[1,0,1,12]]}
[]
["LICENCIAS DE COMPETIDOR (ENERO  - 15 DE MARZO DE 2025)"]
["FECHA","CLUB","CANT.","PRECIO UNITARIO","VALOR A PAGAR","EFECTIVO","TRANSFERENCIA","VALOR CANCELADO","ESTADO","SALDO","COSTO","GANANCIA","OBSERVACIONES"]
["2025-01-07","MARCIAL GRANDA",4,{"v":8,"d":"$ 8.00"},{"$f":"C4*Tabla144[[#This Row],[PRECIO UNITARIO]]","v":{"v":32,"d":"$ 32.00"}},0,{"v":32,"d":"$ 32.00"},{"$f":"F4+G4","v":{"v":32,"d":"$ 32.00"}},{"$f":"IF((E4=H4),\"CANCELADO\",\"SALDO PENDIENTE\")","v":"CANCELADO"},{"$f":"Tabla144[[#This Row],[VALOR A PAGAR]]-Tabla144[[#This Row],[VALOR CANCELADO]]","v":0},{"$f":"Tabla144[[#This Row],[CANT.]]*2","v":{"v":8,"d":"$ 8.00"}},{"$f":"E4-K4","v":{"v":24,"d":"$ 24.00"}}]
["2025-01-08","CHUNG SONG",8,{"v":6,"d":"$ 6.00"},{"$f":"C5*Tabla144[[#This Row],[PRECIO UNITARIO]]","v":{"v":48,"d":"$ 48.00"}},0,{"v":48,"d":"$ 48.00"},{"v":48,"d":"$ 48.00"},"CANCELADO",{"$f":"Tabla144[[#This Row],[VALOR A PAGAR]]-Tabla144[[#This Row],[VALOR CANCELADO]]","v":0},{"$f":"Tabla144[[#This Row],[CANT.]]*2","v":{"v":16,"d":"$ 16.00"}},{"v":32,"d":"$ 32.00"}]
["2025-01-08","TAE BAEK ECUADOR JR.",1,{"v":2,"d":"$ 2.00"},{"$f":"C6*Tabla144[[#This Row],[PRECIO UNITARIO]]","v":{"v":2,"d":"$ 2.00"}},0,{"v":2,"d":"$ 2.00"},{"v":2,"d":"$ 2.00"},"CANCELADO",{"$f":"Tabla144[[#This Row],[VALOR A PAGAR]]-Tabla144[[#This Row],[VALOR CANCELADO]]","v":0},{"$f":"Tabla144[[#This Row],[CANT.]]*2","v":{"v":2,"d":"$ 2.00"}},0]
["2025-01-10","PVM - ROJAS IAN IRON FIST",36,{"v":8,"d":"$ 8.00"},{"$f":"C7*Tabla144[[#This Row],[PRECIO UNITARIO]]","v":{"v":288,"d":"$ 288.00"}},0,{"v":288,"d":"$ 288.00"},{"v":288,"d":"$ 288.00"},"CANCELADO",{"$f":"Tabla144[[#This Row],[VALOR A PAGAR]]-Tabla144[[#This Row],[VALOR CANCELADO]]","v":0},{"$f":"Tabla144[[#This Row],[CANT.]]*2","v":{"v":72,"d":"$ 72.00"}},{"v":216,"d":"$ 216.00"}]
["2025-01-10","PVM - ROJAS IAN IRON FIST",2,{"v":2,"d":"$ 2.00"},{"$f":"C8*Tabla144[[#This Row],[PRECIO UNITARIO]]","v":{"v":4,"d":"$ 4.00"}},0,{"v":4,"d":"$ 4.00"},{"v":4,"d":"$ 4.00"},"CANCELADO",{"$f":"Tabla144[[#This Row],[VALOR A PAGAR]]-Tabla144[[#This Row],[VALOR CANCELADO]]","v":0},{"$f":"Tabla144[[#This Row],[CANT.]]*2","v":{"v":4,"d":"$ 4.00"}},0]
["2025-01-12","MOODUKKWAN TRAINING CENTER",4,{"v":6,"d":"$ 6.00"},{"$f":"C9*Tabla144[[#This Row],[PRECIO UNITARIO]]","v":{"v":24,"d":"$ 24.00"}},0,{"v":24,"d":"$ 24.00"},{"v":24,"d":"$ 24.00"},"CANCELADO",{"$f":"Tabla144[[#This Row],[VALOR A PAGAR]]-Tabla144[[#This Row],[VALOR CANCELADO]]","v":0},{"$f":"Tabla144[[#This Row],[CANT.]]*2","v":{"v":8,"d":"$ 8.00"}},{"v":16,"d":"$ 16.00"}]
["2025-01-13","APOLO",3,{"v":6,"d":"$ 6.00"},{"$f":"C10*Tabla144[[#This Row],[PRECIO UNITARIO]]","v":{"v":18,"d":"$ 18.00"}},0,{"v":18,"d":"$ 18.00"},{"v":18,"d":"$ 18.00"},"CANCELADO",{"$f":"Tabla144[[#This Row],[VALOR A PAGAR]]-Tabla144[[#This Row],[VALOR CANCELADO]]","v":0},{"$f":"Tabla144[[#This Row],[CANT.]]*2","v":{"v":6,"d":"$ 6.00"}},{"v":12,"d":"$ 12.00"}]
["2025-01-15","MIT-TKD",15,{"v":8,"d":"$ 8.00"},{"$f":"C11*Tabla144[[#This Row],[PRECIO UNITARIO]]","v":{"v":120,"d":"$ 120.00"}},0,{"v":120,"d":"$ 120.00"},{"v":120,"d":"$ 120.00"},"CANCELADO",{"$f":"Tabla144[[#This Row],[VALOR A PAGAR]]-Tabla144[[#This Row],[VALOR CANCELADO]]","v":0},{"$f":"Tabla144[[#This Row],[CANT.]]*2","v":{"v":30,"d":"$ 30.00"}},{"v":90,"d":"$ 90.00"}]
["2025-01-15","MOODUKKWAN TRAINING CENTER",2,{"v":6,"d":"$ 6.00"},{"$f":"C12*Tabla144[[#This Row],[PRECIO UNITARIO]]","v":{"v":12,"d":"$ 12.00"}},0,{"v":12,"d":"$ 12.00"},{"v":12,"d":"$ 12.00"},"CANCELADO",{"$f":"Tabla144[[#This Row],[VALOR A PAGAR]]-Tabla144[[#This Row],[VALOR CANCELADO]]","v":0},{"$f":"Tabla144[[#This Row],[CANT.]]*2","v":{"v":4,"d":"$ 4.00"}},{"v":8,"d":"$ 8.00"}]
["2025-01-16","SCORPIUS",1,{"v":6,"d":"$ 6.00"},{"$f":"C13*Tabla144[[#This Row],[PRECIO UNITARIO]]","v":{"v":6,"d":"$ 6.00"}},0,{"v":6,"d":"$ 6.00"},{"v":6,"d":"$ 6.00"},"CANCELADO",{"$f":"Tabla144[[#This Row],[VALOR A PAGAR]]-Tabla144[[#This Row],[VALOR CANCELADO]]","v":0},{"$f":"Tabla144[[#This Row],[CANT.]]*2","v":{"v":2,"d":"$ 2.00"}},{"v":4,"d":"$ 4.00"}]
["2025-01-17","TAE DO ACADEMY",10,{"v":6,"d":"$ 6.00"},{"$f":"C14*Tabla144[[#This Row],[PRECIO UNITARIO]]","v":{"v":60,"d":"$ 60.00"}},0,{"v":60,"d":"$ 60.00"},{"v":60,"d":"$ 60.00"},"CANCELADO",{"$f":"Tabla144[[#This Row],[VALOR A PAGAR]]-Tabla144[[#This Row],[VALOR CANCELADO]]","v":0},{"$f":"Tabla144[[#This Row],[CANT.]]*2","v":{"v":20,"d":"$ 20.00"}},{"v":40,"d":"$ 40.00"}]
["2025-01-20","ASOTKD - P CHIMBACALLE",17,{"v":8,"d":"$ 8.00"},{"$f":"C15*Tabla144[[#This Row],[PRECIO UNITARIO]]","v":{"v":136,"d":"$ 136.00"}},{"v":136,"d":"$ 136.00"},0,{"v":136,"d":"$ 136.00"},"CANCELADO",{"$f":"Tabla144[[#This Row],[VALOR A PAGAR]]-Tabla144[[#This Row],[VALOR CANCELADO]]","v":0},{"$f":"Tabla144[[#This Row],[CANT.]]*2","v":{"v":34,"d":"$ 34.00"}},{"v":102,"d":"$ 102.00"}]
["2025-01-20","ASOTKD - P CHIMBACALLE",1,{"v":2,"d":"$ 2.00"},{"$f":"C16*Tabla144[[#This Row],[PRECIO UNITARIO]]","v":{"v":2,"d":"$ 2.00"}},{"v":2,"d":"$ 2.00"},0,{"v":2,"d":"$ 2.00"},"CANCELADO",{"$f":"Tabla144[[#This Row],[VALOR A PAGAR]]-Tabla144[[#This Row],[VALOR CANCELADO]]","v":0},{"$f":"Tabla144[[#This Row],[CANT.]]*2","v":{"v":2,"d":"$ 2.00"}},0]
["2025-01-20","MSA GRAND MASTER",12,{"v":6,"d":"$ 6.00"},{"$f":"C17*Tabla144[[#This Row],[PRECIO UNITARIO]]","v":{"v":72,"d":"$ 72.00"}},0,{"v":72,"d":"$ 72.00"},{"v":72,"d":"$ 72.00"},"CANCELADO",{"$f":"Tabla144[[#This Row],[VALOR A PAGAR]]-Tabla144[[#This Row],[VALOR CANCELADO]]","v":0},{"$f":"Tabla144[[#This Row],[CANT.]]*2","v":{"v":24,"d":"$ 24.00"}},{"v":48,"d":"$ 48.00"}]
["2025-01-22","KUMGANG DUL",3,{"v":6,"d":"$ 6.00"},{"$f":"C18*Tabla144[[#This Row],[PRECIO UNITARIO]]","v":{"v":18,"d":"$ 18.00"}},0,{"v":18,"d":"$ 18.00"},{"v":18,"d":"$ 18.00"},"CANCELADO",{"$f":"Tabla144[[#This Row],[VALOR A PAGAR]]-Tabla144[[#This Row],[VALOR CANCELADO]]","v":0},{"$f":"Tabla144[[#This Row],[CANT.]]*2","v":{"v":6,"d":"$ 6.00"}},{"v":12,"d":"$ 12.00"},"PAGO CON DIPLOMAS Y CURSO DE ENTRENADORES"]
["2025-01-24","TAE WOONG",25,{"v":8,"d":"$ 8.00"},{"$f":"C19*Tabla144[[#This Row],[PRECIO UNITARIO]]","v":{"v":200,"d":"$ 200.00"}},0,{"v":200,"d":"$ 200.00"},{"v":200,"d":"$ 200.00"},"CANCELADO",{"$f":"Tabla144[[#This Row],[VALOR A PAGAR]]-Tabla144[[#This Row],[VALOR CANCELADO]]","v":0},{"$f":"Tabla144[[#This Row],[CANT.]]*2","v":{"v":50,"d":"$ 50.00"}},{"v":150,"d":"$ 150.00"}]
["2025-01-24","TAE WOONG",2,{"v":6,"d":"$ 6.00"},{"$f":"C20*Tabla144[[#This Row],[PRECIO UNITARIO]]","v":{"v":12,"d":"$ 12.00"}},0,{"v":12,"d":"$ 12.00"},{"v":12,"d":"$ 12.00"},"CANCELADO",{"$f":"Tabla144[[#This Row],[VALOR A PAGAR]]-Tabla144[[#This Row],[VALOR CANCELADO]]","v":0},{"$f":"Tabla144[[#This Row],[CANT.]]*2","v":{"v":4,"d":"$ 4.00"}},{"v":8,"d":"$ 8.00"}]
["2025-01-24","TAE WOONG",5,{"v":2,"d":"$ 2.00"},{"$f":"C21*Tabla144[[#This Row],[PRECIO UNITARIO]]","v":{"v":10,"d":"$ 10.00"}},0,{"v":10,"d":"$ 10.00"},{"v":10,"d":"$ 10.00"},"CANCELADO",{"$f":"Tabla144[[#This Row],[VALOR A PAGAR]]-Tabla144[[#This Row],[VALOR CANCELADO]]","v":0},{"$f":"Tabla144[[#This Row],[CANT.]]*2","v":{"v":10,"d":"$ 10.00"}},0,"SOLO IMPRESIÓN"]
["2025-01-24","EQUILIBRIO",11,{"v":8,"d":"$ 8.00"},{"$f":"C22*Tabla144[[#This Row],[PRECIO UNITARIO]]","v":{"v":88,"d":"$ 88.00"}},0,{"v":88,"d":"$ 88.00"},{"v":88,"d":"$ 88.00"},"CANCELADO",{"$f":"Tabla144[[#This Row],[VALOR A PAGAR]]-Tabla144[[#This Row],[VALOR CANCELADO]]","v":0},{"$f":"Tabla144[[#This Row],[CANT.]]*2","v":{"v":22,"d":"$ 22.00"}},{"v":66,"d":"$ 66.00"}]
["2025-01-24","EQUILIBRIO",2,{"v":6,"d":"$ 6.00"},{"$f":"C23*Tabla144[[#This Row],[PRECIO UNITARIO]]","v":{"v":12,"d":"$ 12.00"}},0,{"v":12,"d":"$ 12.00"},{"v":12,"d":"$ 12.00"},"CANCELADO",{"$f":"Tabla144[[#This Row],[VALOR A PAGAR]]-Tabla144[[#This Row],[VALOR CANCELADO]]","v":0},{"$f":"Tabla144[[#This Row],[CANT.]]*2","v":{"v":4,"d":"$ 4.00"}},{"v":8,"d":"$ 8.00"}]
["2025-01-24","MOODUKKWAN TRAINING CENTER",3,{"v":6,"d":"$ 6.00"},{"$f":"C24*Tabla144[[#This Row],[PRECIO UNITARIO]]","v":{"v":18,"d":"$ 18.00"}},0,{"v":18,"d":"$ 18.00"},{"v":18,"d":"$ 18.00"},"CANCELADO",{"$f":"Tabla144[[#This Row],[VALOR A PAGAR]]-Tabla144[[#This Row],[VALOR CANCELADO]]","v":0},{"$f":"Tabla144[[#This Row],[CANT.]]*2","v":{"v":6,"d":"$ 6.00"}},{"v":12,"d":"$ 12.00"}]
["2025-01-25","PVM - ROJAS IAN IRON FIST",4,{"v":8,"d":"$ 8.00"},{"$f":"C25*Tabla144[[#This Row],[PRECIO UNITARIO]]","v":{"v":32,"d":"$ 32.00"}},0,{"v":32,"d":"$ 32.00"},{"v":32,"d":"$ 32.00"},"CANCELADO",{"$f":"Tabla144[[#This Row],[VALOR A PAGAR]]-Tabla144[[#This Row],[VALOR CANCELADO]]","v":0},{"$f":"Tabla144[[#This Row],[CANT.]]*2","v":{"v":8,"d":"$ 8.00"}},{"v":24,"d":"$ 24.00"}]
["2025-01-27","HAN KUM DO",18,{"v":8,"d":"$ 8.00"},{"$f":"C26*Tabla144[[#This Row],[PRECIO UNITARIO]]","v":{"v":144,"d":"$ 144.00"}},0,{"v":144,"d":"$ 144.00"},{"v":144,"d":"$ 144.00"},"CANCELADO",{"$f":"Tabla144[[#This Row],[VALOR A PAGAR]]-Tabla144[[#This Row],[VALOR CANCELADO]]","v":0},{"$f":"Tabla144[[#This Row],[CANT.]]*2","v":{"v":36,"d":"$ 36.00"}},{"v":108,"d":"$ 108.00"}]
["2025-01-27","TAE SHO KU",7,{"v":8,"d":"$ 8.00"},{"$f":"C27*Tabla144[[#This Row],[PRECIO UNITARIO]]","v":{"v":56,"d":"$ 56.00"}},0,{"v":56,"d":"$ 56.00"},{"v":56,"d":"$ 56.00"},"CANCELADO",{"$f":"Tabla144[[#This Row],[VALOR A PAGAR]]-Tabla144[[#This Row],[VALOR CANCELADO]]","v":0},{"$f":"Tabla144[[#This Row],[CANT.]]*2","v":{"v":14,"d":"$ 14.00"}},{"v":42,"d":"$ 42.00"}]
["2025-01-27","TAE SHO KU",9,{"v":6,"d":"$ 6.00"},{"$f":"C28*Tabla144[[#This Row],[PRECIO UNITARIO]]","v":{"v":54,"d":"$ 54.00"}},0,{"v":54,"d":"$ 54.00"},{"v":54,"d":"$ 54.00"},"CANCELADO",{"$f":"Tabla144[[#This Row],[VALOR A PAGAR]]-Tabla144[[#This Row],[VALOR CANCELADO]]","v":0},{"$f":"Tabla144[[#This Row],[CANT.]]*2","v":{"v":18,"d":"$ 18.00"}},{"v":36,"d":"$ 36.00"}]
["2025-01-27","BAEKJUL",26,{"v":8,"d":"$ 8.00"},{"$f":"C29*Tabla144[[#This Row],[PRECIO UNITARIO]]","v":{"v":208,"d":"$ 208.00"}},0,{"v":208,"d":"$ 208.00"},{"v":208,"d":"$ 208.00"},"CANCELADO",{"$f":"Tabla144[[#This Row],[VALOR A PAGAR]]-Tabla144[[#This Row],[VALOR CANCELADO]]","v":0},{"$f":"Tabla144[[#This Row],[CANT.]]*2","v":{"v":52,"d":"$ 52.00"}},{"v":156,"d":"$ 156.00"}]
["2025-01-28","KO AMÉRICA",2,{"v":6,"d":"$ 6.00"},{"$f":"C30*Tabla144[[#This Row],[PRECIO UNITARIO]]","v":{"v":12,"d":"$ 12.00"}},0,{"v":12,"d":"$ 12.00"},{"v":12,"d":"$ 12.00"},"CANCELADO",{"$f":"Tabla144[[#This Row],[VALOR A PAGAR]]-Tabla144[[#This Row],[VALOR CANCELADO]]","v":0},{"$f":"Tabla144[[#This Row],[CANT.]]*2","v":{"v":4,"d":"$ 4.00"}},{"v":8,"d":"$ 8.00"}]
["2025-01-28","BAEKJUL TEAM AYALAZ",31,{"v":8,"d":"$ 8.00"},{"$f":"C31*Tabla144[[#This Row],[PRECIO UNITARIO]]","v":{"v":248,"d":"$ 248.00"}},0,{"v":248,"d":"$ 248.00"},{"v":248,"d":"$ 248.00"},"CANCELADO",{"$f":"Tabla144[[#This Row],[VALOR A PAGAR]]-Tabla144[[#This Row],[VALOR CANCELADO]]","v":0},{"$f":"Tabla144[[#This Row],[CANT.]]*2","v":{"v":62,"d":"$ 62.00"}},{"v":186,"d":"$ 186.00"}]
["2025-01-28","SIMJANG",13,{"v":8,"d":"$ 8.00"},{"$f":"C32*Tabla144[[#This Row],[PRECIO UNITARIO]]","v":{"v":104,"d":"$ 104.00"}},0,{"v":104,"d":"$ 104.00"},{"v":104,"d":"$ 104.00"},"CANCELADO",{"$f":"Tabla144[[#This Row],[VALOR A PAGAR]]-Tabla144[[#This Row],[VALOR CANCELADO]]","v":0},{"$f":"Tabla144[[#This Row],[CANT.]]*2","v":{"v":26,"d":"$ 26.00"}},{"v":78,"d":"$ 78.00"}]
["2025-01-28","SIMJANG",17,{"v":6,"d":"$ 6.00"},{"$f":"C33*Tabla144[[#This Row],[PRECIO UNITARIO]]","v":{"v":102,"d":"$ 102.00"}},0,{"v":102,"d":"$ 102.00"},{"v":102,"d":"$ 102.00"},"CANCELADO",{"$f":"Tabla144[[#This Row],[VALOR A PAGAR]]-Tabla144[[#This Row],[VALOR CANCELADO]]","v":0},{"$f":"Tabla144[[#This Row],[CANT.]]*2","v":{"v":34,"d":"$ 34.00"}},{"v":68,"d":"$ 68.00"}]
["2025-01-28","ASOTKD - P VICENTINA",1,{"v":6,"d":"$ 6.00"},{"$f":"C34*Tabla144[[#This Row],[PRECIO UNITARIO]]","v":{"v":6,"d":"$ 6.00"}},{"v":6,"d":"$ 6.00"},0,{"v":6,"d":"$ 6.00"},"CANCELADO",{"$f":"Tabla144[[#This Row],[VALOR A PAGAR]]-Tabla144[[#This Row],[VALOR CANCELADO]]","v":0},{"$f":"Tabla144[[#This Row],[CANT.]]*2","v":{"v":2,"d":"$ 2.00"}},{"v":4,"d":"$ 4.00"}]
["2025-01-29","HUANG TOP GYM",9,{"v":8,"d":"$ 8.00"},{"$f":"C35*Tabla144[[#This Row],[PRECIO UNITARIO]]","v":{"v":72,"d":"$ 72.00"}},0,{"v":72,"d":"$ 72.00"},{"v":72,"d":"$ 72.00"},"CANCELADO",{"$f":"Tabla144[[#This Row],[VALOR A PAGAR]]-Tabla144[[#This Row],[VALOR CANCELADO]]","v":0},{"$f":"Tabla144[[#This Row],[CANT.]]*2","v":{"v":18,"d":"$ 18.00"}},{"v":54,"d":"$ 54.00"}]
["2025-01-29","ECUADOR",94,{"v":6,"d":"$ 6.00"},{"$f":"C36*Tabla144[[#This Row],[PRECIO UNITARIO]]","v":{"v":564,"d":"$ 564.00"}},0,{"v":564,"d":"$ 564.00"},{"$f":"F36+G36","v":{"v":564,"d":"$ 564.00"}},{"$f":"IF((E36=H36),\"CANCELADO\",\"SALDO PENDIENTE\")","v":"CANCELADO"},{"$f":"Tabla144[[#This Row],[VALOR A PAGAR]]-Tabla144[[#This Row],[VALOR CANCELADO]]","v":0},{"$f":"Tabla144[[#This Row],[CANT.]]*2","v":{"v":188,"d":"$ 188.00"}},{"$f":"E36-K36","v":{"v":376,"d":"$ 376.00"}}]
["2025-01-29","FARANG",12,{"v":8,"d":"$ 8.00"},{"$f":"C37*Tabla144[[#This Row],[PRECIO UNITARIO]]","v":{"v":96,"d":"$ 96.00"}},0,{"v":96,"d":"$ 96.00"},{"v":96,"d":"$ 96.00"},"CANCELADO",{"$f":"Tabla144[[#This Row],[VALOR A PAGAR]]-Tabla144[[#This Row],[VALOR CANCELADO]]","v":0},{"$f":"Tabla144[[#This Row],[CANT.]]*2","v":{"v":24,"d":"$ 24.00"}},{"v":72,"d":"$ 72.00"}]
["2025-01-29","RYONG TAE",1,{"v":6,"d":"$ 6.00"},{"$f":"C38*Tabla144[[#This Row],[PRECIO UNITARIO]]","v":{"v":6,"d":"$ 6.00"}},0,{"v":7.5,"d":"$ 7.50"},{"v":7.5,"d":"$ 7.50"},"SALDO PENDIENTE",{"$f":"Tabla144[[#This Row],[VALOR A PAGAR]]-Tabla144[[#This Row],[VALOR CANCELADO]]","v":{"v":-1.5,"d":"$ (1.50)"}},{"$f":"Tabla144[[#This Row],[CANT.]]*2","v":{"v":2,"d":"$ 2.00"}},{"v":4,"d":"$ 4.00"},"USA $2,50 PARA CERTIFICADO DE ASCENSO QUEDA A FAVOR 1,50"]
["2025-01-30","UNIVERSIDAD DE LOS HEMISFERIOS",1,{"v":6,"d":"$ 6.00"},{"$f":"C39*Tabla144[[#This Row],[PRECIO UNITARIO]]","v":{"v":6,"d":"$ 6.00"}},{"v":6,"d":"$ 6.00"},0,{"v":6,"d":"$ 6.00"},"CANCELADO",{"$f":"Tabla144[[#This Row],[VALOR A PAGAR]]-Tabla144[[#This Row],[VALOR CANCELADO]]","v":0},{"$f":"Tabla144[[#This Row],[CANT.]]*2","v":{"v":2,"d":"$ 2.00"}},{"v":4,"d":"$ 4.00"}]
["2025-01-31","BAEKJUL TEAM AYALAZ",2,{"v":8,"d":"$ 8.00"},{"$f":"C40*Tabla144[[#This Row],[PRECIO UNITARIO]]","v":{"v":16,"d":"$ 16.00"}},0,{"v":16,"d":"$ 16.00"},{"v":16,"d":"$ 16.00"},"CANCELADO",{"$f":"Tabla144[[#This Row],[VALOR A PAGAR]]-Tabla144[[#This Row],[VALOR CANCELADO]]","v":0},{"$f":"Tabla144[[#This Row],[CANT.]]*2","v":{"v":4,"d":"$ 4.00"}},{"v":12,"d":"$ 12.00"}]
["2025-01-31","CIUDAD DE QUITO",12,{"v":8,"d":"$ 8.00"},{"$f":"C41*Tabla144[[#This Row],[PRECIO UNITARIO]]","v":{"v":96,"d":"$ 96.00"}},0,{"v":96,"d":"$ 96.00"},{"v":96,"d":"$ 96.00"},"CANCELADO",{"$f":"Tabla144[[#This Row],[VALOR A PAGAR]]-Tabla144[[#This Row],[VALOR CANCELADO]]","v":0},{"$f":"Tabla144[[#This Row],[CANT.]]*2","v":{"v":24,"d":"$ 24.00"}},{"v":72,"d":"$ 72.00"},"CANCELA EN DOS PAGOS"]
["2025-01-31","TEAM VENCEDORES",1,{"v":8,"d":"$ 8.00"},{"$f":"C42*Tabla144[[#This Row],[PRECIO UNITARIO]]","v":{"v":8,"d":"$ 8.00"}},0,{"v":8,"d":"$ 8.00"},{"v":8,"d":"$ 8.00"},"CANCELADO",{"$f":"Tabla144[[#This Row],[VALOR A PAGAR]]-Tabla144[[#This Row],[VALOR CANCELADO]]","v":0},{"$f":"Tabla144[[#This Row],[CANT.]]*2","v":{"v":2,"d":"$ 2.00"}},{"v":6,"d":"$ 6.00"}]
["2025-01-31","SOCIEDAD DEPORTIVA CENTRAL",19,{"v":8,"d":"$ 8.00"},{"$f":"C43*Tabla144[[#This Row],[PRECIO UNITARIO]]","v":{"v":152,"d":"$ 152.00"}},{"v":152,"d":"$ 152.00"},0,{"v":152,"d":"$ 152.00"},"CANCELADO",{"$f":"Tabla144[[#This Row],[VALOR A PAGAR]]-Tabla144[[#This Row],[VALOR CANCELADO]]","v":0},{"$f":"Tabla144[[#This Row],[CANT.]]*2","v":{"v":38,"d":"$ 38.00"}},{"v":114,"d":"$ 114.00"}]
["2025-02-04","MOODUKKWAN TRAINING CENTER",1,{"v":8,"d":"$ 8.00"},{"$f":"C44*Tabla144[[#This Row],[PRECIO UNITARIO]]","v":{"v":8,"d":"$ 8.00"}},0,{"v":8,"d":"$ 8.00"},{"v":8,"d":"$ 8.00"},"CANCELADO",{"$f":"Tabla144[[#This Row],[VALOR A PAGAR]]-Tabla144[[#This Row],[VALOR CANCELADO]]","v":0},{"$f":"Tabla144[[#This Row],[CANT.]]*2","v":{"v":2,"d":"$ 2.00"}},{"v":6,"d":"$ 6.00"}]
["2025-02-04","MOODUKKWAN TRAINING CENTER",5,{"v":6,"d":"$ 6.00"},{"$f":"C45*Tabla144[[#This Row],[PRECIO UNITARIO]]","v":{"v":30,"d":"$ 30.00"}},null,{"v":30,"d":"$ 30.00"},{"v":30,"d":"$ 30.00"},"CANCELADO",{"$f":"Tabla144[[#This Row],[VALOR A PAGAR]]-Tabla144[[#This Row],[VALOR CANCELADO]]","v":0},{"$f":"Tabla144[[#This Row],[CANT.]]*2","v":{"v":10,"d":"$ 10.00"}},{"v":20,"d":"$ 20.00"}]
["2025-02-04","JR SPORT",1,{"v":8,"d":"$ 8.00"},{"$f":"C46*Tabla144[[#This Row],[PRECIO UNITARIO]]","v":{"v":8,"d":"$ 8.00"}},{"v":8,"d":"$ 8.00"},0,{"v":8,"d":"$ 8.00"},"CANCELADO",{"$f":"Tabla144[[#This Row],[VALOR A PAGAR]]-Tabla144[[#This Row],[VALOR CANCELADO]]","v":0},{"$f":"Tabla144[[#This Row],[CANT.]]*2","v":{"v":2,"d":"$ 2.00"}},{"v":6,"d":"$ 6.00"}]
["2025-02-04","DRAGON LEE GYM",1,{"v":8,"d":"$ 8.00"},{"$f":"C47*Tabla144[[#This Row],[PRECIO UNITARIO]]","v":{"v":8,"d":"$ 8.00"}},0,{"v":8,"d":"$ 8.00"},{"v":8,"d":"$ 8.00"},"CANCELADO",{"$f":"Tabla144[[#This Row],[VALOR A PAGAR]]-Tabla144[[#This Row],[VALOR CANCELADO]]","v":0},{"$f":"Tabla144[[#This Row],[CANT.]]*2","v":{"v":2,"d":"$ 2.00"}},{"v":6,"d":"$ 6.00"}]
["2025-02-05","BAS PANTHERS",25,{"v":8,"d":"$ 8.00"},{"$f":"C48*Tabla144[[#This Row],[PRECIO UNITARIO]]","v":{"v":200,"d":"$ 200.00"}},0,{"v":200,"d":"$ 200.00"},{"v":200,"d":"$ 200.00"},"CANCELADO",{"$f":"Tabla144[[#This Row],[VALOR A PAGAR]]-Tabla144[[#This Row],[VALOR CANCELADO]]","v":0},{"$f":"Tabla144[[#This Row],[CANT.]]*2","v":{"v":50,"d":"$ 50.00"}},{"v":150,"d":"$ 150.00"},"PASO CON JARROS NAVIDEÑOS SELECCIONADOS PROVINCIALES"]
["2025-02-05","CHUNG SONG",5,{"v":6,"d":"$ 6.00"},{"$f":"C49*Tabla144[[#This Row],[PRECIO UNITARIO]]","v":{"v":30,"d":"$ 30.00"}},0,{"v":30,"d":"$ 30.00"},{"v":30,"d":"$ 30.00"},"CANCELADO",{"$f":"Tabla144[[#This Row],[VALOR A PAGAR]]-Tabla144[[#This Row],[VALOR CANCELADO]]","v":0},{"$f":"Tabla144[[#This Row],[CANT.]]*2","v":{"v":10,"d":"$ 10.00"}},{"v":20,"d":"$ 20.00"}]
["2025-02-05","PIONERO FORTIS",39,{"v":8,"d":"$ 8.00"},{"$f":"C50*Tabla144[[#This Row],[PRECIO UNITARIO]]","v":{"v":312,"d":"$ 312.00"}},0,{"v":312,"d":"$ 312.00"},{"v":312,"d":"$ 312.00"},"CANCELADO",{"$f":"Tabla144[[#This Row],[VALOR A PAGAR]]-Tabla144[[#This Row],[VALOR CANCELADO]]","v":0},{"$f":"Tabla144[[#This Row],[CANT.]]*2","v":{"v":78,"d":"$ 78.00"}},{"v":234,"d":"$ 234.00"}]
["2025-02-07","FIRST CLASS",12,{"v":8,"d":"$ 8.00"},{"$f":"C51*Tabla144[[#This Row],[PRECIO UNITARIO]]","v":{"v":96,"d":"$ 96.00"}},0,{"v":96,"d":"$ 96.00"},{"v":96,"d":"$ 96.00"},"CANCELADO",{"$f":"Tabla144[[#This Row],[VALOR A PAGAR]]-Tabla144[[#This Row],[VALOR CANCELADO]]","v":0},{"$f":"Tabla144[[#This Row],[CANT.]]*2","v":{"v":24,"d":"$ 24.00"}},{"v":72,"d":"$ 72.00"}]
["2025-02-07","FIRST CLASS",3,{"v":6,"d":"$ 6.00"},{"$f":"C52*Tabla144[[#This Row],[PRECIO UNITARIO]]","v":{"v":18,"d":"$ 18.00"}},0,{"v":18,"d":"$ 18.00"},{"v":18,"d":"$ 18.00"},"CANCELADO",{"$f":"Tabla144[[#This Row],[VALOR A PAGAR]]-Tabla144[[#This Row],[VALOR CANCELADO]]","v":0},{"$f":"Tabla144[[#This Row],[CANT.]]*2","v":{"v":6,"d":"$ 6.00"}},{"v":12,"d":"$ 12.00"}]
["2025-02-10","BAS PANTHERS",5,{"v":8,"d":"$ 8.00"},{"$f":"C53*Tabla144[[#This Row],[PRECIO UNITARIO]]","v":{"v":40,"d":"$ 40.00"}},{"v":40,"d":"$ 40.00"},0,{"v":40,"d":"$ 40.00"},"CANCELADO",{"$f":"Tabla144[[#This Row],[VALOR A PAGAR]]-Tabla144[[#This Row],[VALOR CANCELADO]]","v":0},{"$f":"Tabla144[[#This Row],[CANT.]]*2","v":{"v":10,"d":"$ 10.00"}},{"v":30,"d":"$ 30.00"},"PASO CON JARROS NAVIDEÑOS SELECCIONADOS PROVINCIALES"]
["2025-02-10","MICHAYDO",3,{"v":8,"d":"$ 8.00"},{"$f":"C54*Tabla144[[#This Row],[PRECIO UNITARIO]]","v":{"v":24,"d":"$ 24.00"}},0,{"v":24,"d":"$ 24.00"},{"v":24,"d":"$ 24.00"},"CANCELADO",{"$f":"Tabla144[[#This Row],[VALOR A PAGAR]]-Tabla144[[#This Row],[VALOR CANCELADO]]","v":0},{"$f":"Tabla144[[#This Row],[CANT.]]*2","v":{"v":6,"d":"$ 6.00"}},{"v":18,"d":"$ 18.00"}]
["2025-02-10","L. D. C. MEJÍA",24,{"v":8,"d":"$ 8.00"},{"$f":"C55*Tabla144[[#This Row],[PRECIO UNITARIO]]","v":{"v":192,"d":"$ 192.00"}},0,{"v":192,"d":"$ 192.00"},{"v":192,"d":"$ 192.00"},"CANCELADO",{"$f":"Tabla144[[#This Row],[VALOR A PAGAR]]-Tabla144[[#This Row],[VALOR CANCELADO]]","v":0},{"$f":"Tabla144[[#This Row],[CANT.]]*2","v":{"v":48,"d":"$ 48.00"}},{"v":144,"d":"$ 144.00"}]
["2025-02-10","JERATHEL",28,{"v":8,"d":"$ 8.00"},{"$f":"C56*Tabla144[[#This Row],[PRECIO UNITARIO]]","v":{"v":224,"d":"$ 224.00"}},0,{"v":224,"d":"$ 224.00"},{"v":224,"d":"$ 224.00"},"CANCELADO",{"$f":"Tabla144[[#This Row],[VALOR A PAGAR]]-Tabla144[[#This Row],[VALOR CANCELADO]]","v":0},{"$f":"Tabla144[[#This Row],[CANT.]]*2","v":{"v":56,"d":"$ 56.00"}},{"v":168,"d":"$ 168.00"}]
["2025-02-10","JERATHEL",3,{"v":6,"d":"$ 6.00"},{"$f":"C57*Tabla144[[#This Row],[PRECIO UNITARIO]]","v":{"v":18,"d":"$ 18.00"}},0,{"v":18,"d":"$ 18.00"},{"v":18,"d":"$ 18.00"},"CANCELADO",{"$f":"Tabla144[[#This Row],[VALOR A PAGAR]]-Tabla144[[#This Row],[VALOR CANCELADO]]","v":0},{"$f":"Tabla144[[#This Row],[CANT.]]*2","v":{"v":6,"d":"$ 6.00"}},{"v":12,"d":"$ 12.00"}]
["2025-02-10","PYONGYANG",21,{"v":8,"d":"$ 8.00"},{"$f":"C58*Tabla144[[#This Row],[PRECIO UNITARIO]]","v":{"v":168,"d":"$ 168.00"}},0,{"v":168,"d":"$ 168.00"},{"v":168,"d":"$ 168.00"},"CANCELADO",{"$f":"Tabla144[[#This Row],[VALOR A PAGAR]]-Tabla144[[#This Row],[VALOR CANCELADO]]","v":0},{"$f":"Tabla144[[#This Row],[CANT.]]*2","v":{"v":42,"d":"$ 42.00"}},{"v":126,"d":"$ 126.00"}]
["2025-02-10","DOJANG TKD MELO",16,{"v":8,"d":"$ 8.00"},{"$f":"C59*Tabla144[[#This Row],[PRECIO UNITARIO]]","v":{"v":128,"d":"$ 128.00"}},0,{"v":128,"d":"$ 128.00"},{"v":128,"d":"$ 128.00"},"CANCELADO",{"$f":"Tabla144[[#This Row],[VALOR A PAGAR]]-Tabla144[[#This Row],[VALOR CANCELADO]]","v":0},{"$f":"Tabla144[[#This Row],[CANT.]]*2","v":{"v":32,"d":"$ 32.00"}},{"v":96,"d":"$ 96.00"}]
["2025-02-11","SHOGUN",28,{"v":6,"d":"$ 6.00"},{"$f":"C60*Tabla144[[#This Row],[PRECIO UNITARIO]]","v":{"v":168,"d":"$ 168.00"}},0,{"v":168,"d":"$ 168.00"},{"v":168,"d":"$ 168.00"},"CANCELADO",{"$f":"Tabla144[[#This Row],[VALOR A PAGAR]]-Tabla144[[#This Row],[VALOR CANCELADO]]","v":0},{"$f":"Tabla144[[#This Row],[CANT.]]*2","v":{"v":56,"d":"$ 56.00"}},{"v":112,"d":"$ 112.00"}]
["2025-02-11","LOS PUMAS",47,{"v":6,"d":"$ 6.00"},{"$f":"C61*Tabla144[[#This Row],[PRECIO UNITARIO]]","v":{"v":282,"d":"$ 282.00"}},0,{"v":282,"d":"$ 282.00"},{"v":282,"d":"$ 282.00"},"CANCELADO",{"$f":"Tabla144[[#This Row],[VALOR A PAGAR]]-Tabla144[[#This Row],[VALOR CANCELADO]]","v":0},{"$f":"Tabla144[[#This Row],[CANT.]]*2","v":{"v":94,"d":"$ 94.00"}},{"v":188,"d":"$ 188.00"}]
["2025-02-11","SEUL CAPELO ",3,{"v":8,"d":"$ 8.00"},{"$f":"C62*Tabla144[[#This Row],[PRECIO UNITARIO]]","v":{"v":24,"d":"$ 24.00"}},0,{"v":24,"d":"$ 24.00"},{"v":24,"d":"$ 24.00"},"CANCELADO",{"$f":"Tabla144[[#This Row],[VALOR A PAGAR]]-Tabla144[[#This Row],[VALOR CANCELADO]]","v":0},{"$f":"Tabla144[[#This Row],[CANT.]]*2","v":{"v":6,"d":"$ 6.00"}},{"v":18,"d":"$ 18.00"}]
["2025-02-11","SEUL CAPELO ",1,{"v":6,"d":"$ 6.00"},{"$f":"C63*Tabla144[[#This Row],[PRECIO UNITARIO]]","v":{"v":6,"d":"$ 6.00"}},0,{"v":6,"d":"$ 6.00"},{"v":6,"d":"$ 6.00"},"CANCELADO",{"$f":"Tabla144[[#This Row],[VALOR A PAGAR]]-Tabla144[[#This Row],[VALOR CANCELADO]]","v":0},{"$f":"Tabla144[[#This Row],[CANT.]]*2","v":{"v":2,"d":"$ 2.00"}},{"v":4,"d":"$ 4.00"}]
["2025-02-12","BAEKJUL",1,{"v":8,"d":"$ 8.00"},{"$f":"C64*Tabla144[[#This Row],[PRECIO UNITARIO]]","v":{"v":8,"d":"$ 8.00"}},0,{"v":8,"d":"$ 8.00"},{"v":8,"d":"$ 8.00"},"CANCELADO",{"$f":"Tabla144[[#This Row],[VALOR A PAGAR]]-Tabla144[[#This Row],[VALOR CANCELADO]]","v":0},{"$f":"Tabla144[[#This Row],[CANT.]]*2","v":{"v":2,"d":"$ 2.00"}},{"v":6,"d":"$ 6.00"}]
["2025-02-12","KO AMÉRICA",7,{"v":6,"d":"$ 6.00"},{"$f":"C65*Tabla144[[#This Row],[PRECIO UNITARIO]]","v":{"v":42,"d":"$ 42.00"}},0,{"v":42,"d":"$ 42.00"},{"v":42,"d":"$ 42.00"},"CANCELADO",{"$f":"Tabla144[[#This Row],[VALOR A PAGAR]]-Tabla144[[#This Row],[VALOR CANCELADO]]","v":0},{"$f":"Tabla144[[#This Row],[CANT.]]*2","v":{"v":14,"d":"$ 14.00"}},{"v":28,"d":"$ 28.00"}]
["2025-02-12","BLUE DRAGONS",4,{"v":8,"d":"$ 8.00"},{"$f":"C66*Tabla144[[#This Row],[PRECIO UNITARIO]]","v":{"v":32,"d":"$ 32.00"}},0,{"v":32,"d":"$ 32.00"},{"v":32,"d":"$ 32.00"},"CANCELADO",{"$f":"Tabla144[[#This Row],[VALOR A PAGAR]]-Tabla144[[#This Row],[VALOR CANCELADO]]","v":0},{"$f":"Tabla144[[#This Row],[CANT.]]*2","v":{"v":8,"d":"$ 8.00"}},{"v":24,"d":"$ 24.00"}]
["2025-02-12","TAEBAEK ECUADOR",1,{"v":6,"d":"$ 6.00"},{"$f":"C67*Tabla144[[#This Row],[PRECIO UNITARIO]]","v":{"v":6,"d":"$ 6.00"}},0,{"v":6,"d":"$ 6.00"},{"v":6,"d":"$ 6.00"},"CANCELADO",{"$f":"Tabla144[[#This Row],[VALOR A PAGAR]]-Tabla144[[#This Row],[VALOR CANCELADO]]","v":0},{"$f":"Tabla144[[#This Row],[CANT.]]*2","v":{"v":2,"d":"$ 2.00"}},{"v":4,"d":"$ 4.00"}]
["2025-02-12","MERCENARIOS",40,{"v":8,"d":"$ 8.00"},{"$f":"C68*Tabla144[[#This Row],[PRECIO UNITARIO]]","v":{"v":320,"d":"$ 320.00"}},0,{"v":320,"d":"$ 320.00"},{"$f":"F68+G68","v":{"v":320,"d":"$ 320.00"}},{"$f":"IF((E68=H68),\"CANCELADO\",\"SALDO PENDIENTE\")","v":"CANCELADO"},{"$f":"Tabla144[[#This Row],[VALOR A PAGAR]]-Tabla144[[#This Row],[VALOR CANCELADO]]","v":0},{"$f":"Tabla144[[#This Row],[CANT.]]*2","v":{"v":80,"d":"$ 80.00"}},{"$f":"E68-K68","v":{"v":240,"d":"$ 240.00"}}]
["2025-02-12","MERCENARIOS",2,{"v":2,"d":"$ 2.00"},{"$f":"C69*Tabla144[[#This Row],[PRECIO UNITARIO]]","v":{"v":4,"d":"$ 4.00"}},0,{"v":4,"d":"$ 4.00"},{"v":4,"d":"$ 4.00"},"CANCELADO",{"$f":"Tabla144[[#This Row],[VALOR A PAGAR]]-Tabla144[[#This Row],[VALOR CANCELADO]]","v":0},{"$f":"Tabla144[[#This Row],[CANT.]]*2","v":{"v":4,"d":"$ 4.00"}},0]
["2025-02-12","SEUL",1,{"v":6,"d":"$ 6.00"},{"$f":"C70*Tabla144[[#This Row],[PRECIO UNITARIO]]","v":{"v":6,"d":"$ 6.00"}},0,{"v":6,"d":"$ 6.00"},{"v":6,"d":"$ 6.00"},"CANCELADO",{"$f":"Tabla144[[#This Row],[VALOR A PAGAR]]-Tabla144[[#This Row],[VALOR CANCELADO]]","v":0},{"$f":"Tabla144[[#This Row],[CANT.]]*2","v":{"v":2,"d":"$ 2.00"}},{"v":4,"d":"$ 4.00"}]
["2025-02-13","FURIA NEGRA",3,{"v":8,"d":"$ 8.00"},{"$f":"C71*Tabla144[[#This Row],[PRECIO UNITARIO]]","v":{"v":24,"d":"$ 24.00"}},0,{"v":24,"d":"$ 24.00"},{"v":24,"d":"$ 24.00"},"CANCELADO",{"$f":"Tabla144[[#This Row],[VALOR A PAGAR]]-Tabla144[[#This Row],[VALOR CANCELADO]]","v":0},{"$f":"Tabla144[[#This Row],[CANT.]]*2","v":{"v":6,"d":"$ 6.00"}},{"v":18,"d":"$ 18.00"}]
["2025-02-13","KYORUGUI GYM",25,{"v":8,"d":"$ 8.00"},{"$f":"C72*Tabla144[[#This Row],[PRECIO UNITARIO]]","v":{"v":200,"d":"$ 200.00"}},0,{"v":200,"d":"$ 200.00"},{"v":200,"d":"$ 200.00"},"CANCELADO",{"$f":"Tabla144[[#This Row],[VALOR A PAGAR]]-Tabla144[[#This Row],[VALOR CANCELADO]]","v":0},{"$f":"Tabla144[[#This Row],[CANT.]]*2","v":{"v":50,"d":"$ 50.00"}},{"v":150,"d":"$ 150.00"}]
["2025-02-13","MOODUKKWAN TRAINING CENTER",3,{"v":8,"d":"$ 8.00"},{"$f":"C73*Tabla144[[#This Row],[PRECIO UNITARIO]]","v":{"v":24,"d":"$ 24.00"}},0,{"v":24,"d":"$ 24.00"},{"v":24,"d":"$ 24.00"},"CANCELADO",{"$f":"Tabla144[[#This Row],[VALOR A PAGAR]]-Tabla144[[#This Row],[VALOR CANCELADO]]","v":0},{"$f":"Tabla144[[#This Row],[CANT.]]*2","v":{"v":6,"d":"$ 6.00"}},{"v":18,"d":"$ 18.00"}]
["2025-02-13","ARES",1,{"v":8,"d":"$ 8.00"},{"$f":"C74*Tabla144[[#This Row],[PRECIO UNITARIO]]","v":{"v":8,"d":"$ 8.00"}},0,{"v":8,"d":"$ 8.00"},{"v":8,"d":"$ 8.00"},"CANCELADO",{"$f":"Tabla144[[#This Row],[VALOR A PAGAR]]-Tabla144[[#This Row],[VALOR CANCELADO]]","v":0},{"$f":"Tabla144[[#This Row],[CANT.]]*2","v":{"v":2,"d":"$ 2.00"}},{"v":6,"d":"$ 6.00"}]
["2025-02-13","KUMGANG DUL",1,{"v":6,"d":"$ 6.00"},{"$f":"C75*Tabla144[[#This Row],[PRECIO UNITARIO]]","v":{"v":6,"d":"$ 6.00"}},0,{"v":6,"d":"$ 6.00"},{"v":6,"d":"$ 6.00"},"CANCELADO",{"$f":"Tabla144[[#This Row],[VALOR A PAGAR]]-Tabla144[[#This Row],[VALOR CANCELADO]]","v":0},{"$f":"Tabla144[[#This Row],[CANT.]]*2","v":{"v":2,"d":"$ 2.00"}},{"v":4,"d":"$ 4.00"}]
["2025-02-17","KYORUGUI GYM",1,{"v":8,"d":"$ 8.00"},{"$f":"C76*Tabla144[[#This Row],[PRECIO UNITARIO]]","v":{"v":8,"d":"$ 8.00"}},0,{"v":8,"d":"$ 8.00"},{"v":8,"d":"$ 8.00"},"CANCELADO",{"$f":"Tabla144[[#This Row],[VALOR A PAGAR]]-Tabla144[[#This Row],[VALOR CANCELADO]]","v":0},{"$f":"Tabla144[[#This Row],[CANT.]]*2","v":{"v":2,"d":"$ 2.00"}},{"v":6,"d":"$ 6.00"}]
["2025-02-17","BAEKJUL",1,{"v":8,"d":"$ 8.00"},{"$f":"C77*Tabla144[[#This Row],[PRECIO UNITARIO]]","v":{"v":8,"d":"$ 8.00"}},0,{"v":8,"d":"$ 8.00"},{"v":8,"d":"$ 8.00"},"CANCELADO",{"$f":"Tabla144[[#This Row],[VALOR A PAGAR]]-Tabla144[[#This Row],[VALOR CANCELADO]]","v":0},{"$f":"Tabla144[[#This Row],[CANT.]]*2","v":{"v":2,"d":"$ 2.00"}},{"v":6,"d":"$ 6.00"}]
["2025-02-17","FITTKWONDO MEJÍA",8,{"v":8,"d":"$ 8.00"},{"$f":"C78*Tabla144[[#This Row],[PRECIO UNITARIO]]","v":{"v":64,"d":"$ 64.00"}},0,{"v":64,"d":"$ 64.00"},{"v":64,"d":"$ 64.00"},"CANCELADO",{"$f":"Tabla144[[#This Row],[VALOR A PAGAR]]-Tabla144[[#This Row],[VALOR CANCELADO]]","v":0},{"$f":"Tabla144[[#This Row],[CANT.]]*2","v":{"v":16,"d":"$ 16.00"}},{"v":48,"d":"$ 48.00"}]
["2025-02-18","PIONERO",1,{"v":6,"d":"$ 6.00"},{"$f":"C79*Tabla144[[#This Row],[PRECIO UNITARIO]]","v":{"v":6,"d":"$ 6.00"}},0,{"v":6,"d":"$ 6.00"},{"v":6,"d":"$ 6.00"},"CANCELADO",{"$f":"Tabla144[[#This Row],[VALOR A PAGAR]]-Tabla144[[#This Row],[VALOR CANCELADO]]","v":0},{"$f":"Tabla144[[#This Row],[CANT.]]*2","v":{"v":2,"d":"$ 2.00"}},{"v":4,"d":"$ 4.00"}]
["2025-02-18","HIMCHARI",60,{"v":8,"d":"$ 8.00"},{"$f":"C80*Tabla144[[#This Row],[PRECIO UNITARIO]]","v":{"v":480,"d":"$ 480.00"}},0,{"v":480,"d":"$ 480.00"},{"v":480,"d":"$ 480.00"},"CANCELADO",{"$f":"Tabla144[[#This Row],[VALOR A PAGAR]]-Tabla144[[#This Row],[VALOR CANCELADO]]","v":0},{"$f":"Tabla144[[#This Row],[CANT.]]*2","v":{"v":120,"d":"$ 120.00"}},{"v":360,"d":"$ 360.00"}]
["2025-02-18","EQUILIBRIO",1,{"v":8,"d":"$ 8.00"},{"$f":"C81*Tabla144[[#This Row],[PRECIO UNITARIO]]","v":{"v":8,"d":"$ 8.00"}},0,{"v":8,"d":"$ 8.00"},{"v":8,"d":"$ 8.00"},"CANCELADO",{"$f":"Tabla144[[#This Row],[VALOR A PAGAR]]-Tabla144[[#This Row],[VALOR CANCELADO]]","v":0},{"$f":"Tabla144[[#This Row],[CANT.]]*2","v":{"v":2,"d":"$ 2.00"}},{"v":6,"d":"$ 6.00"}]
["2025-02-19","CHUNG SONG",13,{"v":6,"d":"$ 6.00"},{"$f":"C82*Tabla144[[#This Row],[PRECIO UNITARIO]]","v":{"v":78,"d":"$ 78.00"}},0,{"v":78,"d":"$ 78.00"},{"v":78,"d":"$ 78.00"},"CANCELADO",{"$f":"Tabla144[[#This Row],[VALOR A PAGAR]]-Tabla144[[#This Row],[VALOR CANCELADO]]","v":0},{"$f":"Tabla144[[#This Row],[CANT.]]*2","v":{"v":26,"d":"$ 26.00"}},{"v":52,"d":"$ 52.00"}]
["2025-02-19","SAN SEBASTIÁN (RAÚL TIPÁN)",4,{"v":6,"d":"$ 6.00"},{"$f":"C83*Tabla144[[#This Row],[PRECIO UNITARIO]]","v":{"v":24,"d":"$ 24.00"}},0,{"v":24,"d":"$ 24.00"},{"v":24,"d":"$ 24.00"},"CANCELADO",{"$f":"Tabla144[[#This Row],[VALOR A PAGAR]]-Tabla144[[#This Row],[VALOR CANCELADO]]","v":0},{"$f":"Tabla144[[#This Row],[CANT.]]*2","v":{"v":8,"d":"$ 8.00"}},{"v":16,"d":"$ 16.00"}]
["2025-02-19","CIUDAD DE QUITO",1,{"v":6,"d":"$ 6.00"},{"$f":"C84*Tabla144[[#This Row],[PRECIO UNITARIO]]","v":{"v":6,"d":"$ 6.00"}},0,{"v":6,"d":"$ 6.00"},{"v":6,"d":"$ 6.00"},"CANCELADO",{"$f":"Tabla144[[#This Row],[VALOR A PAGAR]]-Tabla144[[#This Row],[VALOR CANCELADO]]","v":0},{"$f":"Tabla144[[#This Row],[CANT.]]*2","v":{"v":2,"d":"$ 2.00"}},{"v":4,"d":"$ 4.00"}]
["2025-02-19","SOCIEDAD DEPORTIVA CENTRAL",49,{"v":8,"d":"$ 8.00"},{"$f":"C85*Tabla144[[#This Row],[PRECIO UNITARIO]]","v":{"v":392,"d":"$ 392.00"}},0,{"v":392,"d":"$ 392.00"},{"v":392,"d":"$ 392.00"},"CANCELADO",{"$f":"Tabla144[[#This Row],[VALOR A PAGAR]]-Tabla144[[#This Row],[VALOR CANCELADO]]","v":0},{"$f":"Tabla144[[#This Row],[CANT.]]*2","v":{"v":98,"d":"$ 98.00"}},{"v":294,"d":"$ 294.00"},"CRUCE DEUDA  IMPLEMENTOS(TATAMI)"]
["2025-02-20","SEUL CHUNG UI",27,{"v":8,"d":"$ 8.00"},{"$f":"C86*Tabla144[[#This Row],[PRECIO UNITARIO]]","v":{"v":216,"d":"$ 216.00"}},0,{"v":216,"d":"$ 216.00"},{"v":216,"d":"$ 216.00"},"CANCELADO",{"$f":"Tabla144[[#This Row],[VALOR A PAGAR]]-Tabla144[[#This Row],[VALOR CANCELADO]]","v":0},{"$f":"Tabla144[[#This Row],[CANT.]]*2","v":{"v":54,"d":"$ 54.00"}},{"v":162,"d":"$ 162.00"}]
["2025-02-20","TAEGUK JUCARO",4,{"v":8,"d":"$ 8.00"},{"$f":"C87*Tabla144[[#This Row],[PRECIO UNITARIO]]","v":{"v":32,"d":"$ 32.00"}},0,{"v":32,"d":"$ 32.00"},{"v":32,"d":"$ 32.00"},"CANCELADO",{"$f":"Tabla144[[#This Row],[VALOR A PAGAR]]-Tabla144[[#This Row],[VALOR CANCELADO]]","v":0},{"$f":"Tabla144[[#This Row],[CANT.]]*2","v":{"v":8,"d":"$ 8.00"}},{"v":24,"d":"$ 24.00"}]
["2025-02-20","YONG TIGER",1,{"v":6,"d":"$ 6.00"},{"$f":"C88*Tabla144[[#This Row],[PRECIO UNITARIO]]","v":{"v":6,"d":"$ 6.00"}},0,{"v":10,"d":"$ 10.00"},{"v":10,"d":"$ 10.00"},"SALDO PENDIENTE",{"$f":"Tabla144[[#This Row],[VALOR A PAGAR]]-Tabla144[[#This Row],[VALOR CANCELADO]]","v":{"v":-4,"d":"$ (4.00)"}},{"$f":"Tabla144[[#This Row],[CANT.]]*2","v":{"v":2,"d":"$ 2.00"}},{"v":4,"d":"$ 4.00"}]
["2025-02-21","LEÓN",66,{"v":8,"d":"$ 8.00"},{"$f":"C89*Tabla144[[#This Row],[PRECIO UNITARIO]]","v":{"v":528,"d":"$ 528.00"}},{"v":200,"d":"$ 200.00"},{"v":328,"d":"$ 328.00"},{"v":528,"d":"$ 528.00"},"CANCELADO",{"$f":"Tabla144[[#This Row],[VALOR A PAGAR]]-Tabla144[[#This Row],[VALOR CANCELADO]]","v":0},{"$f":"Tabla144[[#This Row],[CANT.]]*2","v":{"v":132,"d":"$ 132.00"}},{"v":396,"d":"$ 396.00"}]
["2025-02-21","BLUE DRAGONS",20,{"v":8,"d":"$ 8.00"},{"$f":"C90*Tabla144[[#This Row],[PRECIO UNITARIO]]","v":{"v":160,"d":"$ 160.00"}},0,{"v":160,"d":"$ 160.00"},{"v":160,"d":"$ 160.00"},"CANCELADO",{"$f":"Tabla144[[#This Row],[VALOR A PAGAR]]-Tabla144[[#This Row],[VALOR CANCELADO]]","v":0},{"$f":"Tabla144[[#This Row],[CANT.]]*2","v":{"v":40,"d":"$ 40.00"}},{"v":120,"d":"$ 120.00"},"CANCELA EN DOS DEPÓSITOS"]
["2025-02-21","BORJA'S LIONS",10,{"v":8,"d":"$ 8.00"},{"$f":"C91*Tabla144[[#This Row],[PRECIO UNITARIO]]","v":{"v":80,"d":"$ 80.00"}},0,{"v":80,"d":"$ 80.00"},{"v":80,"d":"$ 80.00"},"CANCELADO",{"$f":"Tabla144[[#This Row],[VALOR A PAGAR]]-Tabla144[[#This Row],[VALOR CANCELADO]]","v":0},{"$f":"Tabla144[[#This Row],[CANT.]]*2","v":{"v":20,"d":"$ 20.00"}},{"v":60,"d":"$ 60.00"}]
["2025-02-21","SAN FRANCISCO TIGRES",9,{"v":6,"d":"$ 6.00"},{"$f":"C92*Tabla144[[#This Row],[PRECIO UNITARIO]]","v":{"v":54,"d":"$ 54.00"}},0,{"v":54,"d":"$ 54.00"},{"v":54,"d":"$ 54.00"},"CANCELADO",{"$f":"Tabla144[[#This Row],[VALOR A PAGAR]]-Tabla144[[#This Row],[VALOR CANCELADO]]","v":0},{"$f":"Tabla144[[#This Row],[CANT.]]*2","v":{"v":18,"d":"$ 18.00"}},{"v":36,"d":"$ 36.00"}]
["2025-02-24","SURYUN",1,{"v":6,"d":"$ 6.00"},{"$f":"C93*Tabla144[[#This Row],[PRECIO UNITARIO]]","v":{"v":6,"d":"$ 6.00"}},0,{"v":6,"d":"$ 6.00"},{"v":6,"d":"$ 6.00"},"CANCELADO",{"$f":"Tabla144[[#This Row],[VALOR A PAGAR]]-Tabla144[[#This Row],[VALOR CANCELADO]]","v":0},{"$f":"Tabla144[[#This Row],[CANT.]]*2","v":{"v":2,"d":"$ 2.00"}},{"v":4,"d":"$ 4.00"}]
["2025-02-24","SAN SEBASTIÁN ",16,{"v":8,"d":"$ 8.00"},{"$f":"C94*Tabla144[[#This Row],[PRECIO UNITARIO]]","v":{"v":128,"d":"$ 128.00"}},0,{"v":128,"d":"$ 128.00"},{"v":128,"d":"$ 128.00"},"CANCELADO",{"$f":"Tabla144[[#This Row],[VALOR A PAGAR]]-Tabla144[[#This Row],[VALOR CANCELADO]]","v":0},{"$f":"Tabla144[[#This Row],[CANT.]]*2","v":{"v":32,"d":"$ 32.00"}},{"v":96,"d":"$ 96.00"}]
["2025-02-24","SAN SEBASTIÁN ",2,{"v":2,"d":"$ 2.00"},{"$f":"C95*Tabla144[[#This Row],[PRECIO UNITARIO]]","v":{"v":4,"d":"$ 4.00"}},0,{"v":4,"d":"$ 4.00"},{"v":4,"d":"$ 4.00"},"CANCELADO",{"$f":"Tabla144[[#This Row],[VALOR A PAGAR]]-Tabla144[[#This Row],[VALOR CANCELADO]]","v":0},{"$f":"Tabla144[[#This Row],[CANT.]]*2","v":{"v":4,"d":"$ 4.00"}},0,"SOLO IMPRESIÓN"]
["2025-02-24","CHUNG SONG",76,{"v":6,"d":"$ 6.00"},{"$f":"C96*Tabla144[[#This Row],[PRECIO UNITARIO]]","v":{"v":456,"d":"$ 456.00"}},0,{"v":456,"d":"$ 456.00"},{"v":456,"d":"$ 456.00"},"CANCELADO",{"$f":"Tabla144[[#This Row],[VALOR A PAGAR]]-Tabla144[[#This Row],[VALOR CANCELADO]]","v":0},{"$f":"Tabla144[[#This Row],[CANT.]]*2","v":{"v":152,"d":"$ 152.00"}},{"v":304,"d":"$ 304.00"}]
["2025-02-24","BAEJUL TEAM FERNÁNDEZ",2,{"v":8,"d":"$ 8.00"},{"$f":"C97*Tabla144[[#This Row],[PRECIO UNITARIO]]","v":{"v":16,"d":"$ 16.00"}},0,{"v":16,"d":"$ 16.00"},{"v":16,"d":"$ 16.00"},"CANCELADO",{"$f":"Tabla144[[#This Row],[VALOR A PAGAR]]-Tabla144[[#This Row],[VALOR CANCELADO]]","v":0},{"$f":"Tabla144[[#This Row],[CANT.]]*2","v":{"v":4,"d":"$ 4.00"}},{"v":12,"d":"$ 12.00"}]
["2025-02-24","BORJA'S LIONS",10,{"v":6,"d":"$ 6.00"},{"$f":"C98*Tabla144[[#This Row],[PRECIO UNITARIO]]","v":{"v":60,"d":"$ 60.00"}},0,{"v":60,"d":"$ 60.00"},{"v":60,"d":"$ 60.00"},"CANCELADO",{"$f":"Tabla144[[#This Row],[VALOR A PAGAR]]-Tabla144[[#This Row],[VALOR CANCELADO]]","v":0},{"$f":"Tabla144[[#This Row],[CANT.]]*2","v":{"v":20,"d":"$ 20.00"}},{"v":40,"d":"$ 40.00"}]
["2025-02-24","BORJA'S LIONS",24,{"v":8,"d":"$ 8.00"},{"$f":"C99*Tabla144[[#This Row],[PRECIO UNITARIO]]","v":{"v":192,"d":"$ 192.00"}},0,{"v":192,"d":"$ 192.00"},{"v":192,"d":"$ 192.00"},"CANCELADO",{"$f":"Tabla144[[#This Row],[VALOR A PAGAR]]-Tabla144[[#This Row],[VALOR CANCELADO]]","v":0},{"$f":"Tabla144[[#This Row],[CANT.]]*2","v":{"v":48,"d":"$ 48.00"}},{"v":144,"d":"$ 144.00"}]
["2025-02-24","LOS PUMAS",4,{"v":6,"d":"$ 6.00"},{"$f":"C100*Tabla144[[#This Row],[PRECIO UNITARIO]]","v":{"v":24,"d":"$ 24.00"}},0,{"v":24,"d":"$ 24.00"},{"$f":"F100+G100","v":{"v":24,"d":"$ 24.00"}},{"$f":"IF((E100=H100),\"CANCELADO\",\"SALDO PENDIENTE\")","v":"CANCELADO"},{"$f":"Tabla144[[#This Row],[VALOR A PAGAR]]-Tabla144[[#This Row],[VALOR CANCELADO]]","v":0},{"$f":"Tabla144[[#This Row],[CANT.]]*2","v":{"v":8,"d":"$ 8.00"}},{"$f":"E100-K100","v":{"v":16,"d":"$ 16.00"}}]
["2025-02-24","KOREAN DRAGON",2,{"v":8,"d":"$ 8.00"},{"$f":"C101*Tabla144[[#This Row],[PRECIO UNITARIO]]","v":{"v":16,"d":"$ 16.00"}},0,{"v":16,"d":"$ 16.00"},{"v":16,"d":"$ 16.00"},"CANCELADO",{"$f":"Tabla144[[#This Row],[VALOR A PAGAR]]-Tabla144[[#This Row],[VALOR CANCELADO]]","v":0},{"$f":"Tabla144[[#This Row],[CANT.]]*2","v":{"v":4,"d":"$ 4.00"}},{"v":12,"d":"$ 12.00"}]
["2025-02-24","FARANG",7,{"v":8,"d":"$ 8.00"},{"$f":"C102*Tabla144[[#This Row],[PRECIO UNITARIO]]","v":{"v":56,"d":"$ 56.00"}},0,{"v":56,"d":"$ 56.00"},{"v":56,"d":"$ 56.00"},"CANCELADO",{"$f":"Tabla144[[#This Row],[VALOR A PAGAR]]-Tabla144[[#This Row],[VALOR CANCELADO]]","v":0},{"$f":"Tabla144[[#This Row],[CANT.]]*2","v":{"v":14,"d":"$ 14.00"}},{"v":42,"d":"$ 42.00"}]
["2025-02-24","TAEBAEK ECUADOR",1,{"v":8,"d":"$ 8.00"},{"$f":"C103*Tabla144[[#This Row],[PRECIO UNITARIO]]","v":{"v":8,"d":"$ 8.00"}},0,{"v":8,"d":"$ 8.00"},{"v":8,"d":"$ 8.00"},"CANCELADO",{"$f":"Tabla144[[#This Row],[VALOR A PAGAR]]-Tabla144[[#This Row],[VALOR CANCELADO]]","v":0},{"$f":"Tabla144[[#This Row],[CANT.]]*2","v":{"v":2,"d":"$ 2.00"}},{"v":6,"d":"$ 6.00"}]
["2025-02-24","KUKKIWON",1,{"v":6,"d":"$ 6.00"},{"$f":"C104*Tabla144[[#This Row],[PRECIO UNITARIO]]","v":{"v":6,"d":"$ 6.00"}},0,{"v":6,"d":"$ 6.00"},{"v":6,"d":"$ 6.00"},"CANCELADO",{"$f":"Tabla144[[#This Row],[VALOR A PAGAR]]-Tabla144[[#This Row],[VALOR CANCELADO]]","v":0},{"$f":"Tabla144[[#This Row],[CANT.]]*2","v":{"v":2,"d":"$ 2.00"}},{"v":4,"d":"$ 4.00"}]
["2025-02-24","KUKKIWON",8,{"v":8,"d":"$ 8.00"},{"$f":"C105*Tabla144[[#This Row],[PRECIO UNITARIO]]","v":{"v":64,"d":"$ 64.00"}},0,{"v":64,"d":"$ 64.00"},{"v":64,"d":"$ 64.00"},"CANCELADO",{"$f":"Tabla144[[#This Row],[VALOR A PAGAR]]-Tabla144[[#This Row],[VALOR CANCELADO]]","v":0},{"$f":"Tabla144[[#This Row],[CANT.]]*2","v":{"v":16,"d":"$ 16.00"}},{"v":48,"d":"$ 48.00"}]
["2025-02-24","MINOTAUROS",12,{"v":8,"d":"$ 8.00"},{"$f":"C106*Tabla144[[#This Row],[PRECIO UNITARIO]]","v":{"v":96,"d":"$ 96.00"}},0,{"v":96,"d":"$ 96.00"},{"v":96,"d":"$ 96.00"},"CANCELADO",{"$f":"Tabla144[[#This Row],[VALOR A PAGAR]]-Tabla144[[#This Row],[VALOR CANCELADO]]","v":0},{"$f":"Tabla144[[#This Row],[CANT.]]*2","v":{"v":24,"d":"$ 24.00"}},{"v":72,"d":"$ 72.00"},"CANCELA EN DOS PAGOS"]
["2025-02-24","APOLO",26,{"v":6,"d":"$ 6.00"},{"$f":"C107*Tabla144[[#This Row],[PRECIO UNITARIO]]","v":{"v":156,"d":"$ 156.00"}},0,{"v":156,"d":"$ 156.00"},{"v":156,"d":"$ 156.00"},"CANCELADO",{"$f":"Tabla144[[#This Row],[VALOR A PAGAR]]-Tabla144[[#This Row],[VALOR CANCELADO]]","v":0},{"$f":"Tabla144[[#This Row],[CANT.]]*2","v":{"v":52,"d":"$ 52.00"}},{"v":104,"d":"$ 104.00"}]
["2025-02-24","DRAGON GYM",8,{"v":8,"d":"$ 8.00"},{"$f":"C108*Tabla144[[#This Row],[PRECIO UNITARIO]]","v":{"v":64,"d":"$ 64.00"}},0,{"v":64,"d":"$ 64.00"},{"v":64,"d":"$ 64.00"},"CANCELADO",{"$f":"Tabla144[[#This Row],[VALOR A PAGAR]]-Tabla144[[#This Row],[VALOR CANCELADO]]","v":0},{"$f":"Tabla144[[#This Row],[CANT.]]*2","v":{"v":16,"d":"$ 16.00"}},{"v":48,"d":"$ 48.00"}]
["2025-02-24","ATLAS CLUB",2,{"v":8,"d":"$ 8.00"},{"$f":"C109*Tabla144[[#This Row],[PRECIO UNITARIO]]","v":{"v":16,"d":"$ 16.00"}},0,{"v":16,"d":"$ 16.00"},{"v":16,"d":"$ 16.00"},"CANCELADO",{"$f":"Tabla144[[#This Row],[VALOR A PAGAR]]-Tabla144[[#This Row],[VALOR CANCELADO]]","v":0},{"$f":"Tabla144[[#This Row],[CANT.]]*2","v":{"v":4,"d":"$ 4.00"}},{"v":12,"d":"$ 12.00"}]
["2025-02-24","ATLAS CLUB",9,{"v":6,"d":"$ 6.00"},{"$f":"C110*Tabla144[[#This Row],[PRECIO UNITARIO]]","v":{"v":54,"d":"$ 54.00"}},0,{"v":54,"d":"$ 54.00"},{"v":54,"d":"$ 54.00"},"CANCELADO",{"$f":"Tabla144[[#This Row],[VALOR A PAGAR]]-Tabla144[[#This Row],[VALOR CANCELADO]]","v":0},{"$f":"Tabla144[[#This Row],[CANT.]]*2","v":{"v":18,"d":"$ 18.00"}},{"v":36,"d":"$ 36.00"}]
["2025-02-24","ATLAS CLUB",2,{"v":3,"d":"$ 3.00"},{"$f":"C111*Tabla144[[#This Row],[PRECIO UNITARIO]]","v":{"v":6,"d":"$ 6.00"}},0,{"v":6,"d":"$ 6.00"},{"v":6,"d":"$ 6.00"},"CANCELADO",{"$f":"Tabla144[[#This Row],[VALOR A PAGAR]]-Tabla144[[#This Row],[VALOR CANCELADO]]","v":0},{"$f":"Tabla144[[#This Row],[CANT.]]*2","v":{"v":4,"d":"$ 4.00"}},{"v":2,"d":"$ 2.00"},"50% TARIFA POR CAPACIDADES ESPECIALES"]
["2025-02-24","MINOTAUROS",12,{"v":8,"d":"$ 8.00"},{"$f":"C112*Tabla144[[#This Row],[PRECIO UNITARIO]]","v":{"v":96,"d":"$ 96.00"}},0,{"v":96,"d":"$ 96.00"},{"v":96,"d":"$ 96.00"},"CANCELADO",{"$f":"Tabla144[[#This Row],[VALOR A PAGAR]]-Tabla144[[#This Row],[VALOR CANCELADO]]","v":0},{"$f":"Tabla144[[#This Row],[CANT.]]*2","v":{"v":24,"d":"$ 24.00"}},{"v":72,"d":"$ 72.00"}]
["2025-02-24","MOODUKKWAN TRAINING CENTER",10,{"v":6,"d":"$ 6.00"},{"$f":"C113*Tabla144[[#This Row],[PRECIO UNITARIO]]","v":{"v":60,"d":"$ 60.00"}},0,{"v":60,"d":"$ 60.00"},{"v":60,"d":"$ 60.00"},"CANCELADO",{"$f":"Tabla144[[#This Row],[VALOR A PAGAR]]-Tabla144[[#This Row],[VALOR CANCELADO]]","v":0},{"$f":"Tabla144[[#This Row],[CANT.]]*2","v":{"v":20,"d":"$ 20.00"}},{"v":40,"d":"$ 40.00"},"CANCELA EN DOS PAGOS"]
["2025-02-24","MOODUKKWAN TRAINING CENTER",15,{"v":8,"d":"$ 8.00"},{"$f":"C114*Tabla144[[#This Row],[PRECIO UNITARIO]]","v":{"v":120,"d":"$ 120.00"}},0,{"v":120,"d":"$ 120.00"},{"v":120,"d":"$ 120.00"},"CANCELADO",{"$f":"Tabla144[[#This Row],[VALOR A PAGAR]]-Tabla144[[#This Row],[VALOR CANCELADO]]","v":0},{"$f":"Tabla144[[#This Row],[CANT.]]*2","v":{"v":30,"d":"$ 30.00"}},{"v":90,"d":"$ 90.00"}]
["2025-02-24","TAE DO ACADEMY",1,{"v":6,"d":"$ 6.00"},{"$f":"C115*Tabla144[[#This Row],[PRECIO UNITARIO]]","v":{"v":6,"d":"$ 6.00"}},0,{"v":6,"d":"$ 6.00"},{"v":6,"d":"$ 6.00"},"CANCELADO",{"$f":"Tabla144[[#This Row],[VALOR A PAGAR]]-Tabla144[[#This Row],[VALOR CANCELADO]]","v":0},{"$f":"Tabla144[[#This Row],[CANT.]]*2","v":{"v":2,"d":"$ 2.00"}},{"v":4,"d":"$ 4.00"}]
["2025-02-24","TAE DO ACADEMY",19,{"v":8,"d":"$ 8.00"},{"$f":"C116*Tabla144[[#This Row],[PRECIO UNITARIO]]","v":{"v":152,"d":"$ 152.00"}},0,{"v":152,"d":"$ 152.00"},{"v":152,"d":"$ 152.00"},"CANCELADO",{"$f":"Tabla144[[#This Row],[VALOR A PAGAR]]-Tabla144[[#This Row],[VALOR CANCELADO]]","v":0},{"$f":"Tabla144[[#This Row],[CANT.]]*2","v":{"v":38,"d":"$ 38.00"}},{"v":114,"d":"$ 114.00"}]
["2025-02-24","ARES",21,{"v":6,"d":"$ 6.00"},{"$f":"C117*Tabla144[[#This Row],[PRECIO UNITARIO]]","v":{"v":126,"d":"$ 126.00"}},0,{"v":126,"d":"$ 126.00"},{"v":126,"d":"$ 126.00"},"CANCELADO",{"$f":"Tabla144[[#This Row],[VALOR A PAGAR]]-Tabla144[[#This Row],[VALOR CANCELADO]]","v":0},{"$f":"Tabla144[[#This Row],[CANT.]]*2","v":{"v":42,"d":"$ 42.00"}},{"v":84,"d":"$ 84.00"}]
["2025-02-24","JOSEON LEGACY",15,{"v":6,"d":"$ 6.00"},{"$f":"C118*Tabla144[[#This Row],[PRECIO UNITARIO]]","v":{"v":90,"d":"$ 90.00"}},0,{"v":90,"d":"$ 90.00"},{"v":90,"d":"$ 90.00"},"CANCELADO",{"$f":"Tabla144[[#This Row],[VALOR A PAGAR]]-Tabla144[[#This Row],[VALOR CANCELADO]]","v":0},{"$f":"Tabla144[[#This Row],[CANT.]]*2","v":{"v":30,"d":"$ 30.00"}},{"v":60,"d":"$ 60.00"}]
["2025-02-24","JOSEON LEGACY",22,{"v":8,"d":"$ 8.00"},{"$f":"C119*Tabla144[[#This Row],[PRECIO UNITARIO]]","v":{"v":176,"d":"$ 176.00"}},0,{"v":176,"d":"$ 176.00"},{"v":176,"d":"$ 176.00"},"CANCELADO",{"$f":"Tabla144[[#This Row],[VALOR A PAGAR]]-Tabla144[[#This Row],[VALOR CANCELADO]]","v":0},{"$f":"Tabla144[[#This Row],[CANT.]]*2","v":{"v":44,"d":"$ 44.00"}},{"v":132,"d":"$ 132.00"}]
["2025-02-24","ESPE",10,{"v":6,"d":"$ 6.00"},{"$f":"C120*Tabla144[[#This Row],[PRECIO UNITARIO]]","v":{"v":60,"d":"$ 60.00"}},0,{"v":60,"d":"$ 60.00"},{"v":60,"d":"$ 60.00"},"CANCELADO",{"$f":"Tabla144[[#This Row],[VALOR A PAGAR]]-Tabla144[[#This Row],[VALOR CANCELADO]]","v":0},{"$f":"Tabla144[[#This Row],[CANT.]]*2","v":{"v":20,"d":"$ 20.00"}},{"v":40,"d":"$ 40.00"}]
["2025-02-24","ESPE",15,{"v":8,"d":"$ 8.00"},{"$f":"C121*Tabla144[[#This Row],[PRECIO UNITARIO]]","v":{"v":120,"d":"$ 120.00"}},0,{"v":120,"d":"$ 120.00"},{"v":120,"d":"$ 120.00"},"CANCELADO",{"$f":"Tabla144[[#This Row],[VALOR A PAGAR]]-Tabla144[[#This Row],[VALOR CANCELADO]]","v":0},{"$f":"Tabla144[[#This Row],[CANT.]]*2","v":{"v":30,"d":"$ 30.00"}},{"v":90,"d":"$ 90.00"}]
["2025-02-24","MARCIAL GRANDA",9,{"v":8,"d":"$ 8.00"},{"$f":"C122*Tabla144[[#This Row],[PRECIO UNITARIO]]","v":{"v":72,"d":"$ 72.00"}},0,{"v":72,"d":"$ 72.00"},{"v":72,"d":"$ 72.00"},"CANCELADO",{"$f":"Tabla144[[#This Row],[VALOR A PAGAR]]-Tabla144[[#This Row],[VALOR CANCELADO]]","v":0},{"$f":"Tabla144[[#This Row],[CANT.]]*2","v":{"v":18,"d":"$ 18.00"}},{"v":54,"d":"$ 54.00"}]
["2025-02-24","SEUL YEONG GU",3,{"v":8,"d":"$ 8.00"},{"$f":"C123*Tabla144[[#This Row],[PRECIO UNITARIO]]","v":{"v":24,"d":"$ 24.00"}},0,{"v":24,"d":"$ 24.00"},{"v":24,"d":"$ 24.00"},"CANCELADO",{"$f":"Tabla144[[#This Row],[VALOR A PAGAR]]-Tabla144[[#This Row],[VALOR CANCELADO]]","v":0},{"$f":"Tabla144[[#This Row],[CANT.]]*2","v":{"v":6,"d":"$ 6.00"}},{"v":18,"d":"$ 18.00"}]
["2025-02-24","CHAMPIONS FOR LIFE",9,{"v":6,"d":"$ 6.00"},{"$f":"C124*Tabla144[[#This Row],[PRECIO UNITARIO]]","v":{"v":54,"d":"$ 54.00"}},0,{"v":54,"d":"$ 54.00"},{"v":54,"d":"$ 54.00"},"CANCELADO",{"$f":"Tabla144[[#This Row],[VALOR A PAGAR]]-Tabla144[[#This Row],[VALOR CANCELADO]]","v":0},{"$f":"Tabla144[[#This Row],[CANT.]]*2","v":{"v":18,"d":"$ 18.00"}},{"v":36,"d":"$ 36.00"}]
["2025-02-24","UTE",4,{"v":8,"d":"$ 8.00"},{"$f":"C125*Tabla144[[#This Row],[PRECIO UNITARIO]]","v":{"v":32,"d":"$ 32.00"}},0,{"v":32,"d":"$ 32.00"},{"v":32,"d":"$ 32.00"},"CANCELADO",{"$f":"Tabla144[[#This Row],[VALOR A PAGAR]]-Tabla144[[#This Row],[VALOR CANCELADO]]","v":0},{"$f":"Tabla144[[#This Row],[CANT.]]*2","v":{"v":8,"d":"$ 8.00"}},{"v":24,"d":"$ 24.00"}]
["2025-02-25","DRACO",16,{"v":6,"d":"$ 6.00"},{"$f":"C126*Tabla144[[#This Row],[PRECIO UNITARIO]]","v":{"v":96,"d":"$ 96.00"}},0,{"v":96,"d":"$ 96.00"},{"v":96,"d":"$ 96.00"},"CANCELADO",{"$f":"Tabla144[[#This Row],[VALOR A PAGAR]]-Tabla144[[#This Row],[VALOR CANCELADO]]","v":0},{"$f":"Tabla144[[#This Row],[CANT.]]*2","v":{"v":32,"d":"$ 32.00"}},{"v":64,"d":"$ 64.00"}]
["2025-02-25","KUMGANG DUL",2,{"v":6,"d":"$ 6.00"},{"$f":"C127*Tabla144[[#This Row],[PRECIO UNITARIO]]","v":{"v":12,"d":"$ 12.00"}},0,{"v":12,"d":"$ 12.00"},{"v":12,"d":"$ 12.00"},"CANCELADO",{"$f":"Tabla144[[#This Row],[VALOR A PAGAR]]-Tabla144[[#This Row],[VALOR CANCELADO]]","v":0},{"$f":"Tabla144[[#This Row],[CANT.]]*2","v":{"v":4,"d":"$ 4.00"}},{"v":8,"d":"$ 8.00"}]
["2025-02-25","JIDOKWAN",1,{"v":6,"d":"$ 6.00"},{"$f":"C128*Tabla144[[#This Row],[PRECIO UNITARIO]]","v":{"v":6,"d":"$ 6.00"}},0,{"v":6,"d":"$ 6.00"},{"v":6,"d":"$ 6.00"},"CANCELADO",{"$f":"Tabla144[[#This Row],[VALOR A PAGAR]]-Tabla144[[#This Row],[VALOR CANCELADO]]","v":0},{"$f":"Tabla144[[#This Row],[CANT.]]*2","v":{"v":2,"d":"$ 2.00"}},{"v":4,"d":"$ 4.00"}]
["2025-02-25","MOODUKKWAN TRAINING CENTER",1,{"v":6,"d":"$ 6.00"},{"$f":"C129*Tabla144[[#This Row],[PRECIO UNITARIO]]","v":{"v":6,"d":"$ 6.00"}},0,{"v":6,"d":"$ 6.00"},{"v":6,"d":"$ 6.00"},"CANCELADO",{"$f":"Tabla144[[#This Row],[VALOR A PAGAR]]-Tabla144[[#This Row],[VALOR CANCELADO]]","v":0},{"$f":"Tabla144[[#This Row],[CANT.]]*2","v":{"v":2,"d":"$ 2.00"}},{"v":4,"d":"$ 4.00"}]
["2025-02-26","ASOTKD - VICENTINA",4,{"v":6,"d":"$ 6.00"},{"$f":"C130*Tabla144[[#This Row],[PRECIO UNITARIO]]","v":{"v":24,"d":"$ 24.00"}},{"v":24,"d":"$ 24.00"},0,{"v":24,"d":"$ 24.00"},"CANCELADO",{"$f":"Tabla144[[#This Row],[VALOR A PAGAR]]-Tabla144[[#This Row],[VALOR CANCELADO]]","v":0},{"$f":"Tabla144[[#This Row],[CANT.]]*2","v":{"v":8,"d":"$ 8.00"}},{"v":16,"d":"$ 16.00"}]
["2025-02-26","ASOTKD - VICENTINA",7,{"v":8,"d":"$ 8.00"},{"$f":"C131*Tabla144[[#This Row],[PRECIO UNITARIO]]","v":{"v":56,"d":"$ 56.00"}},{"v":56,"d":"$ 56.00"},0,{"v":56,"d":"$ 56.00"},"CANCELADO",{"$f":"Tabla144[[#This Row],[VALOR A PAGAR]]-Tabla144[[#This Row],[VALOR CANCELADO]]","v":0},{"$f":"Tabla144[[#This Row],[CANT.]]*2","v":{"v":14,"d":"$ 14.00"}},{"v":42,"d":"$ 42.00"}]
["2025-02-27","BAS PANTHERS",1,{"v":8,"d":"$ 8.00"},{"$f":"C132*Tabla144[[#This Row],[PRECIO UNITARIO]]","v":{"v":8,"d":"$ 8.00"}},0,{"v":8,"d":"$ 8.00"},{"$f":"F132+G132","v":{"v":8,"d":"$ 8.00"}},{"$f":"IF((E132=H132),\"CANCELADO\",\"SALDO PENDIENTE\")","v":"CANCELADO"},{"$f":"Tabla144[[#This Row],[VALOR A PAGAR]]-Tabla144[[#This Row],[VALOR CANCELADO]]","v":0},{"$f":"Tabla144[[#This Row],[CANT.]]*2","v":{"v":2,"d":"$ 2.00"}},{"$f":"E132-K132","v":{"v":6,"d":"$ 6.00"}}]
["2025-02-27","SCORPIUS",80,{"v":8,"d":"$ 8.00"},{"$f":"C133*Tabla144[[#This Row],[PRECIO UNITARIO]]","v":{"v":640,"d":"$ 640.00"}},0,{"v":640,"d":"$ 640.00"},{"v":640,"d":"$ 640.00"},"CANCELADO",{"$f":"Tabla144[[#This Row],[VALOR A PAGAR]]-Tabla144[[#This Row],[VALOR CANCELADO]]","v":0},{"$f":"Tabla144[[#This Row],[CANT.]]*2","v":{"v":160,"d":"$ 160.00"}},{"v":480,"d":"$ 480.00"}]
["2025-02-27","SEUL GEDEON",10,{"v":8,"d":"$ 8.00"},{"$f":"C134*Tabla144[[#This Row],[PRECIO UNITARIO]]","v":{"v":80,"d":"$ 80.00"}},0,{"v":80,"d":"$ 80.00"},{"v":80,"d":"$ 80.00"},"CANCELADO",{"$f":"Tabla144[[#This Row],[VALOR A PAGAR]]-Tabla144[[#This Row],[VALOR CANCELADO]]","v":0},{"$f":"Tabla144[[#This Row],[CANT.]]*2","v":{"v":20,"d":"$ 20.00"}},{"v":60,"d":"$ 60.00"}]
["2025-02-28","PIONERO FORTIS",1,{"v":2,"d":"$ 2.00"},{"$f":"C135*Tabla144[[#This Row],[PRECIO UNITARIO]]","v":{"v":2,"d":"$ 2.00"}},{"v":2,"d":"$ 2.00"},0,{"v":2,"d":"$ 2.00"},"CANCELADO",{"$f":"Tabla144[[#This Row],[VALOR A PAGAR]]-Tabla144[[#This Row],[VALOR CANCELADO]]","v":0},{"$f":"Tabla144[[#This Row],[CANT.]]*2","v":{"v":2,"d":"$ 2.00"}},0]
["2025-02-28","PIONERO FORTIS",1,{"v":8,"d":"$ 8.00"},{"$f":"C136*Tabla144[[#This Row],[PRECIO UNITARIO]]","v":{"v":8,"d":"$ 8.00"}},{"v":8,"d":"$ 8.00"},0,{"v":8,"d":"$ 8.00"},"CANCELADO",{"$f":"Tabla144[[#This Row],[VALOR A PAGAR]]-Tabla144[[#This Row],[VALOR CANCELADO]]","v":0},{"$f":"Tabla144[[#This Row],[CANT.]]*2","v":{"v":2,"d":"$ 2.00"}},{"v":6,"d":"$ 6.00"}]
["2025-02-28","TAE BAEK ECUADOR JR.",1,{"v":2,"d":"$ 2.00"},{"$f":"C137*Tabla144[[#This Row],[PRECIO UNITARIO]]","v":{"v":2,"d":"$ 2.00"}},{"v":2,"d":"$ 2.00"},0,{"v":2,"d":"$ 2.00"},"CANCELADO",{"$f":"Tabla144[[#This Row],[VALOR A PAGAR]]-Tabla144[[#This Row],[VALOR CANCELADO]]","v":0},{"$f":"Tabla144[[#This Row],[CANT.]]*2","v":{"v":2,"d":"$ 2.00"}},0]
["2025-02-28","UNIVERSAL",6,{"v":8,"d":"$ 8.00"},{"$f":"C138*Tabla144[[#This Row],[PRECIO UNITARIO]]","v":{"v":48,"d":"$ 48.00"}},0,{"v":48,"d":"$ 48.00"},{"v":48,"d":"$ 48.00"},"CANCELADO",{"$f":"Tabla144[[#This Row],[VALOR A PAGAR]]-Tabla144[[#This Row],[VALOR CANCELADO]]","v":0},{"$f":"Tabla144[[#This Row],[CANT.]]*2","v":{"v":12,"d":"$ 12.00"}},{"v":36,"d":"$ 36.00"}]
["2025-02-28","KORYO",2,{"v":6,"d":"$ 6.00"},{"$f":"C139*Tabla144[[#This Row],[PRECIO UNITARIO]]","v":{"v":12,"d":"$ 12.00"}},0,{"v":12,"d":"$ 12.00"},{"v":12,"d":"$ 12.00"},"CANCELADO",{"$f":"Tabla144[[#This Row],[VALOR A PAGAR]]-Tabla144[[#This Row],[VALOR CANCELADO]]","v":0},{"$f":"Tabla144[[#This Row],[CANT.]]*2","v":{"v":4,"d":"$ 4.00"}},{"v":8,"d":"$ 8.00"}]
["2025-03-06","DRAGON GYM",28,{"v":8,"d":"$ 8.00"},{"$f":"C140*Tabla144[[#This Row],[PRECIO UNITARIO]]","v":{"v":224,"d":"$ 224.00"}},0,{"v":224,"d":"$ 224.00"},{"v":224,"d":"$ 224.00"},"CANCELADO",{"$f":"Tabla144[[#This Row],[VALOR A PAGAR]]-Tabla144[[#This Row],[VALOR CANCELADO]]","v":0},{"$f":"Tabla144[[#This Row],[CANT.]]*2","v":{"v":56,"d":"$ 56.00"}},{"v":168,"d":"$ 168.00"}]
["2025-03-07","SAN SEBASTIÁN (LUIS TIPÁN)",1,{"v":6,"d":"$ 6.00"},{"$f":"C141*Tabla144[[#This Row],[PRECIO UNITARIO]]","v":{"v":6,"d":"$ 6.00"}},0,{"v":6,"d":"$ 6.00"},{"v":6,"d":"$ 6.00"},"CANCELADO",{"$f":"Tabla144[[#This Row],[VALOR A PAGAR]]-Tabla144[[#This Row],[VALOR CANCELADO]]","v":0},{"$f":"Tabla144[[#This Row],[CANT.]]*2","v":{"v":2,"d":"$ 2.00"}},{"v":4,"d":"$ 4.00"}]
["2025-03-12","ASOTKD - VICENTINA",3,{"v":6,"d":"$ 6.00"},{"$f":"C142*Tabla144[[#This Row],[PRECIO UNITARIO]]","v":{"v":18,"d":"$ 18.00"}},{"v":18,"d":"$ 18.00"},0,{"v":18,"d":"$ 18.00"},"CANCELADO",{"$f":"Tabla144[[#This Row],[VALOR A PAGAR]]-Tabla144[[#This Row],[VALOR CANCELADO]]","v":0},{"$f":"Tabla144[[#This Row],[CANT.]]*2","v":{"v":6,"d":"$ 6.00"}},{"v":12,"d":"$ 12.00"}]
["2025-03-12","ASOTKD - VICENTINA",5,{"v":8,"d":"$ 8.00"},{"$f":"C143*Tabla144[[#This Row],[PRECIO UNITARIO]]","v":{"v":40,"d":"$ 40.00"}},{"v":40,"d":"$ 40.00"},0,{"v":40,"d":"$ 40.00"},"CANCELADO",{"$f":"Tabla144[[#This Row],[VALOR A PAGAR]]-Tabla144[[#This Row],[VALOR CANCELADO]]","v":0},{"$f":"Tabla144[[#This Row],[CANT.]]*2","v":{"v":10,"d":"$ 10.00"}},{"v":30,"d":"$ 30.00"}]
["2025-03-12","SAN FRANCISCO TIGRES",1,{"v":6,"d":"$ 6.00"},{"$f":"C144*Tabla144[[#This Row],[PRECIO UNITARIO]]","v":{"v":6,"d":"$ 6.00"}},0,{"v":6,"d":"$ 6.00"},{"v":6,"d":"$ 6.00"},"CANCELADO",{"$f":"Tabla144[[#This Row],[VALOR A PAGAR]]-Tabla144[[#This Row],[VALOR CANCELADO]]","v":0},{"$f":"Tabla144[[#This Row],[CANT.]]*2","v":{"v":2,"d":"$ 2.00"}},{"v":4,"d":"$ 4.00"}]
["2025-03-12","MOODUKKWAN TRAINING CENTER",1,{"v":6,"d":"$ 6.00"},{"$f":"C145*Tabla144[[#This Row],[PRECIO UNITARIO]]","v":{"v":6,"d":"$ 6.00"}},0,{"v":6,"d":"$ 6.00"},{"v":6,"d":"$ 6.00"},"CANCELADO",{"$f":"Tabla144[[#This Row],[VALOR A PAGAR]]-Tabla144[[#This Row],[VALOR CANCELADO]]","v":0},{"$f":"Tabla144[[#This Row],[CANT.]]*2","v":{"v":2,"d":"$ 2.00"}},{"v":4,"d":"$ 4.00"}]
["2025-03-13","USFQ",1,{"v":6,"d":"$ 6.00"},{"$f":"C146*Tabla144[[#This Row],[PRECIO UNITARIO]]","v":{"v":6,"d":"$ 6.00"}},0,{"v":6,"d":"$ 6.00"},{"v":6,"d":"$ 6.00"},"CANCELADO",{"$f":"Tabla144[[#This Row],[VALOR A PAGAR]]-Tabla144[[#This Row],[VALOR CANCELADO]]","v":0},{"$f":"Tabla144[[#This Row],[CANT.]]*2","v":{"v":2,"d":"$ 2.00"}},{"v":4,"d":"$ 4.00"}]
["2025-03-12","ASOTKD - P CHIMBACALLE",17,{"v":6,"d":"$ 6.00"},{"$f":"C147*Tabla144[[#This Row],[PRECIO UNITARIO]]","v":{"v":102,"d":"$ 102.00"}},{"v":102,"d":"$ 102.00"},0,{"v":102,"d":"$ 102.00"},"CANCELADO",{"$f":"Tabla144[[#This Row],[VALOR A PAGAR]]-Tabla144[[#This Row],[VALOR CANCELADO]]","v":0},{"$f":"Tabla144[[#This Row],[CANT.]]*2","v":{"v":34,"d":"$ 34.00"}},{"v":68,"d":"$ 68.00"}]
[null,"TOTAL",{"$f":"SUM(C4:C147)","v":1650},null,{"$f":"SUBTOTAL(109,Tabla144[VALOR A PAGAR])","v":{"v":12002,"d":"$12,002.00"}},{"$f":"SUM(F4:F147)","v":{"v":802,"d":"$802.00"}},{"$f":"SUM(G4:G147)","v":{"v":11205.5,"d":"$11,205.50"}},{"$f":"SUM(H4:H147)","v":{"v":12007.5,"d":"$12,007.50"}}]
[null,null,"GAL ELABORADOS",null,"A RECAUDARSE","RECAUDADO EN EFECTIVO","RECAUDADO EN TRANSFERENCIA"]
[]
[]
[null,"RECAUDADO","MONTO"]
[null,"EFECTIVO",{"$f":"F148","v":{"v":802,"d":"$802.00"}}]
[null,"TRANSFERENCIA",{"$f":"G148","v":{"v":11205.5,"d":"$11,205.50"}}]
[null,"TOTAL",{"$f":"SUM(C153:C154)","v":{"v":12007.5,"d":"$12,007.50"}}]
[]
[]
[null,"POR COBRAR","MONTO"]
[]
[null,"TOTAL",{"$f":"SUM(C159:C159)","v":{"v":0,"d":"$0.00"}}]
[]
[]
[null,"DEVOLVER O HACER PASO","MONTO"]
[null,{"$f":"B38","v":"RYONG TAE"},{"v":1.5,"d":"$1.50"}]
[null,{"$f":"B88","v":"YONG TIGER"},{"v":4,"d":"$4.00"}]
[null,"TOTAL",{"$f":"SUM(C164:C165)","v":{"v":5.5,"d":"$5.50"}}]
{"$rows_empty":1353}
[null,null,"BENJAMIN MATIAS "]

{"sheet":"CERTIFICADOS DE ASCENSO 2024","index":5,"n_rows":124,"n_cols":15,"rows_kept":124,"merged":[[0,0,1,12],[103,0,103,1]]}
["DIPLOMAS DE ASCENSO (5 SEPTIEMBRE - DICIEMBRE 2024)"]
[]
["FECHA","CLUB","CANT.","PRECIO UNITARIO","VALOR A PAGAR","EFECTIVO","TRANSFERENCIA","VALOR CANCELADO","ESTADO","SALDO","COSTO","GANANCIA","OBSERVACIONES",null,"TOTAL EFECTIVO"]
["2024-09-04","RENACER",4,{"v":2,"d":"$ 2.00"},{"$f":"Tabla14253[[#This Row],[CANT.]]*Tabla14253[[#This Row],[PRECIO UNITARIO]]","v":{"v":8,"d":"$8.00"}},0,{"v":8,"d":"$ 8.00"},{"$f":"Tabla14253[[#This Row],[EFECTIVO]]+Tabla14253[[#This Row],[TRANSFERENCIA]]","v":{"v":8,"d":"$ 8.00"}},{"$f":"IF((E4=H4),\"CANCELADO\",\"SALDO PENDIENTE\")","v":"CANCELADO"},{"$f":"Tabla14253[[#This Row],[VALOR A PAGAR]]-Tabla14253[[#This Row],[VALOR CANCELADO]]","v":0},{"$f":"Tabla14253[[#This Row],[VALOR A PAGAR]]*0.5","v":{"v":4,"d":"$ 4.00"}},{"$f":"Tabla14253[[#This Row],[VALOR A PAGAR]]-Tabla14253[[#This Row],[COSTO]]","v":{"v":4,"d":"$ 4.00"}}]
["2024-09-05","LEÓN",22,{"v":2,"d":"$ 2.00"},{"$f":"Tabla14253[[#This Row],[CANT.]]*Tabla14253[[#This Row],[PRECIO UNITARIO]]","v":{"v":44,"d":"$44.00"}},0,{"v":44,"d":"$ 44.00"},{"$f":"Tabla14253[[#This Row],[EFECTIVO]]+Tabla14253[[#This Row],[TRANSFERENCIA]]","v":{"v":44,"d":"$ 44.00"}},"CANCELADO",{"$f":"Tabla14253[[#This Row],[VALOR A PAGAR]]-Tabla14253[[#This Row],[VALOR CANCELADO]]","v":0},{"$f":"Tabla14253[[#This Row],[VALOR A PAGAR]]*0.5","v":{"v":22,"d":"$ 22.00"}},{"$f":"Tabla14253[[#This Row],[VALOR A PAGAR]]-Tabla14253[[#This Row],[COSTO]]","v":{"v":22,"d":"$ 22.00"}}]
["2024-09-06","KORYO",1,{"v":2,"d":"$ 2.00"},{"$f":"Tabla14253[[#This Row],[CANT.]]*Tabla14253[[#This Row],[PRECIO UNITARIO]]","v":{"v":2,"d":"$2.00"}},{"v":2,"d":"$ 2.00"},0,{"$f":"Tabla14253[[#This Row],[EFECTIVO]]+Tabla14253[[#This Row],[TRANSFERENCIA]]","v":{"v":2,"d":"$ 2.00"}},"CANCELADO",{"$f":"Tabla14253[[#This Row],[VALOR A PAGAR]]-Tabla14253[[#This Row],[VALOR CANCELADO]]","v":0},{"$f":"Tabla14253[[#This Row],[VALOR A PAGAR]]*0.5","v":{"v":1,"d":"$ 1.00"}},{"$f":"Tabla14253[[#This Row],[VALOR A PAGAR]]-Tabla14253[[#This Row],[COSTO]]","v":{"v":1,"d":"$ 1.00"}}]
["2024-09-06","BORJA'S LIONS",1,{"v":2,"d":"$ 2.00"},{"$f":"Tabla14253[[#This Row],[CANT.]]*Tabla14253[[#This Row],[PRECIO UNITARIO]]","v":{"v":2,"d":"$2.00"}},{"v":2,"d":"$ 2.00"},0,{"$f":"Tabla14253[[#This Row],[EFECTIVO]]+Tabla14253[[#This Row],[TRANSFERENCIA]]","v":{"v":2,"d":"$ 2.00"}},"CANCELADO",{"$f":"Tabla14253[[#This Row],[VALOR A PAGAR]]-Tabla14253[[#This Row],[VALOR CANCELADO]]","v":0},{"$f":"Tabla14253[[#This Row],[VALOR A PAGAR]]*0.5","v":{"v":1,"d":"$ 1.00"}},{"$f":"Tabla14253[[#This Row],[VALOR A PAGAR]]-Tabla14253[[#This Row],[COSTO]]","v":{"v":1,"d":"$ 1.00"}},"REIMPRESIÓN"]
["2024-09-09","KO AMÉRICA",4,{"v":2,"d":"$ 2.00"},{"$f":"Tabla14253[[#This Row],[CANT.]]*Tabla14253[[#This Row],[PRECIO UNITARIO]]","v":{"v":8,"d":"$8.00"}},0,{"v":8,"d":"$ 8.00"},{"$f":"Tabla14253[[#This Row],[EFECTIVO]]+Tabla14253[[#This Row],[TRANSFERENCIA]]","v":{"v":8,"d":"$ 8.00"}},"CANCELADO",{"$f":"Tabla14253[[#This Row],[VALOR A PAGAR]]-Tabla14253[[#This Row],[VALOR CANCELADO]]","v":0},{"$f":"Tabla14253[[#This Row],[VALOR A PAGAR]]*0.5","v":{"v":4,"d":"$ 4.00"}},{"$f":"Tabla14253[[#This Row],[VALOR A PAGAR]]-Tabla14253[[#This Row],[COSTO]]","v":{"v":4,"d":"$ 4.00"}}]
["2024-09-10","KORYO DF DOJANG",7,{"v":2,"d":"$ 2.00"},{"$f":"Tabla14253[[#This Row],[CANT.]]*Tabla14253[[#This Row],[PRECIO UNITARIO]]","v":{"v":14,"d":"$14.00"}},{"v":14,"d":"$ 14.00"},0,{"$f":"Tabla14253[[#This Row],[EFECTIVO]]+Tabla14253[[#This Row],[TRANSFERENCIA]]","v":{"v":14,"d":"$ 14.00"}},"CANCELADO",{"$f":"Tabla14253[[#This Row],[VALOR A PAGAR]]-Tabla14253[[#This Row],[VALOR CANCELADO]]","v":0},{"$f":"Tabla14253[[#This Row],[VALOR A PAGAR]]*0.5","v":{"v":7,"d":"$ 7.00"}},{"$f":"Tabla14253[[#This Row],[VALOR A PAGAR]]-Tabla14253[[#This Row],[COSTO]]","v":{"v":7,"d":"$ 7.00"}}]
["2024-09-12","ECUADOR",1,{"v":2,"d":"$ 2.00"},{"$f":"Tabla14253[[#This Row],[CANT.]]*Tabla14253[[#This Row],[PRECIO UNITARIO]]","v":{"v":2,"d":"$2.00"}},0,{"v":2,"d":"$ 2.00"},{"$f":"Tabla14253[[#This Row],[EFECTIVO]]+Tabla14253[[#This Row],[TRANSFERENCIA]]","v":{"v":2,"d":"$ 2.00"}},"CANCELADO",{"$f":"Tabla14253[[#This Row],[VALOR A PAGAR]]-Tabla14253[[#This Row],[VALOR CANCELADO]]","v":0},{"$f":"Tabla14253[[#This Row],[VALOR A PAGAR]]*0.5","v":{"v":1,"d":"$ 1.00"}},{"$f":"Tabla14253[[#This Row],[VALOR A PAGAR]]-Tabla14253[[#This Row],[COSTO]]","v":{"v":1,"d":"$ 1.00"}}]
["2024-09-12","BORJA'S LIONS",2,{"v":2,"d":"$ 2.00"},{"$f":"Tabla14253[[#This Row],[CANT.]]*Tabla14253[[#This Row],[PRECIO UNITARIO]]","v":{"v":4,"d":"$4.00"}},0,{"v":4,"d":"$ 4.00"},{"$f":"Tabla14253[[#This Row],[EFECTIVO]]+Tabla14253[[#This Row],[TRANSFERENCIA]]","v":{"v":4,"d":"$ 4.00"}},"CANCELADO",{"$f":"Tabla14253[[#This Row],[VALOR A PAGAR]]-Tabla14253[[#This Row],[VALOR CANCELADO]]","v":0},{"$f":"Tabla14253[[#This Row],[VALOR A PAGAR]]*0.5","v":{"v":2,"d":"$ 2.00"}},{"$f":"Tabla14253[[#This Row],[VALOR A PAGAR]]-Tabla14253[[#This Row],[COSTO]]","v":{"v":2,"d":"$ 2.00"}}]
["2024-09-13","JR SPORT",1,{"v":2,"d":"$ 2.00"},{"$f":"Tabla14253[[#This Row],[CANT.]]*Tabla14253[[#This Row],[PRECIO UNITARIO]]","v":{"v":2,"d":"$2.00"}},{"v":2,"d":"$ 2.00"},0,{"$f":"Tabla14253[[#This Row],[EFECTIVO]]+Tabla14253[[#This Row],[TRANSFERENCIA]]","v":{"v":2,"d":"$ 2.00"}},"CANCELADO",{"$f":"Tabla14253[[#This Row],[VALOR A PAGAR]]-Tabla14253[[#This Row],[VALOR CANCELADO]]","v":0},{"$f":"Tabla14253[[#This Row],[VALOR A PAGAR]]*0.5","v":{"v":1,"d":"$ 1.00"}},{"$f":"Tabla14253[[#This Row],[VALOR A PAGAR]]-Tabla14253[[#This Row],[COSTO]]","v":{"v":1,"d":"$ 1.00"}}]
["2024-09-17","CAMU",15,{"v":2,"d":"$ 2.00"},{"$f":"Tabla14253[[#This Row],[CANT.]]*Tabla14253[[#This Row],[PRECIO UNITARIO]]","v":{"v":30,"d":"$30.00"}},0,{"v":30,"d":"$ 30.00"},{"$f":"Tabla14253[[#This Row],[EFECTIVO]]+Tabla14253[[#This Row],[TRANSFERENCIA]]","v":{"v":30,"d":"$ 30.00"}},"CANCELADO",{"$f":"Tabla14253[[#This Row],[VALOR A PAGAR]]-Tabla14253[[#This Row],[VALOR CANCELADO]]","v":0},{"$f":"Tabla14253[[#This Row],[VALOR A PAGAR]]*0.5","v":{"v":15,"d":"$ 15.00"}},{"$f":"Tabla14253[[#This Row],[VALOR A PAGAR]]-Tabla14253[[#This Row],[COSTO]]","v":{"v":15,"d":"$ 15.00"}}]
["2024-09-19","S. D. CENTRAL (LIVEO NAVAL)",11,{"v":2,"d":"$ 2.00"},{"$f":"Tabla14253[[#This Row],[CANT.]]*Tabla14253[[#This Row],[PRECIO UNITARIO]]","v":{"v":22,"d":"$22.00"}},0,{"v":22,"d":"$ 22.00"},{"$f":"Tabla14253[[#This Row],[EFECTIVO]]+Tabla14253[[#This Row],[TRANSFERENCIA]]","v":{"v":22,"d":"$ 22.00"}},"CANCELADO",{"$f":"Tabla14253[[#This Row],[VALOR A PAGAR]]-Tabla14253[[#This Row],[VALOR CANCELADO]]","v":0},{"$f":"Tabla14253[[#This Row],[VALOR A PAGAR]]*0.5","v":{"v":11,"d":"$ 11.00"}},{"$f":"Tabla14253[[#This Row],[VALOR A PAGAR]]-Tabla14253[[#This Row],[COSTO]]","v":{"v":11,"d":"$ 11.00"}},"CANJE"]
["2024-09-19","EQUILIBRIO",9,{"v":2,"d":"$ 2.00"},{"$f":"Tabla14253[[#This Row],[CANT.]]*Tabla14253[[#This Row],[PRECIO UNITARIO]]","v":{"v":18,"d":"$18.00"}},0,{"v":18,"d":"$ 18.00"},{"$f":"Tabla14253[[#This Row],[EFECTIVO]]+Tabla14253[[#This Row],[TRANSFERENCIA]]","v":{"v":18,"d":"$ 18.00"}},"CANCELADO",{"$f":"Tabla14253[[#This Row],[VALOR A PAGAR]]-Tabla14253[[#This Row],[VALOR CANCELADO]]","v":0},{"$f":"Tabla14253[[#This Row],[VALOR A PAGAR]]*0.5","v":{"v":9,"d":"$ 9.00"}},{"$f":"Tabla14253[[#This Row],[VALOR A PAGAR]]-Tabla14253[[#This Row],[COSTO]]","v":{"v":9,"d":"$ 9.00"}}]
["2024-09-19","SEUL LA SALLE","SALDO ANTERIOR ",{"v":7,"d":"$ 7.00"},{"v":7,"d":"$7.00"},0,{"v":7,"d":"$ 7.00"},{"$f":"Tabla14253[[#This Row],[EFECTIVO]]+Tabla14253[[#This Row],[TRANSFERENCIA]]","v":{"v":7,"d":"$ 7.00"}},"CANCELADO",{"$f":"Tabla14253[[#This Row],[VALOR A PAGAR]]-Tabla14253[[#This Row],[VALOR CANCELADO]]","v":0},{"$f":"Tabla14253[[#This Row],[VALOR A PAGAR]]*0.5","v":{"v":3.5,"d":"$ 3.50"}},{"$f":"Tabla14253[[#This Row],[VALOR A PAGAR]]-Tabla14253[[#This Row],[COSTO]]","v":{"v":3.5,"d":"$ 3.50"}},"PAGO SALDO DE 28-05-2024"]
["2024-09-19","SEÚL GEDEÓN",2,{"v":2,"d":"$ 2.00"},{"$f":"Tabla14253[[#This Row],[CANT.]]*Tabla14253[[#This Row],[PRECIO UNITARIO]]","v":{"v":4,"d":"$4.00"}},0,{"v":4,"d":"$ 4.00"},{"$f":"Tabla14253[[#This Row],[EFECTIVO]]+Tabla14253[[#This Row],[TRANSFERENCIA]]","v":{"v":4,"d":"$ 4.00"}},"CANCELADO",{"$f":"Tabla14253[[#This Row],[VALOR A PAGAR]]-Tabla14253[[#This Row],[VALOR CANCELADO]]","v":0},{"$f":"Tabla14253[[#This Row],[VALOR A PAGAR]]*0.5","v":{"v":2,"d":"$ 2.00"}},{"$f":"Tabla14253[[#This Row],[VALOR A PAGAR]]-Tabla14253[[#This Row],[COSTO]]","v":{"v":2,"d":"$ 2.00"}}]
["2024-09-24","KO AMÉRICA",12,{"v":2,"d":"$ 2.00"},{"$f":"Tabla14253[[#This Row],[CANT.]]*Tabla14253[[#This Row],[PRECIO UNITARIO]]","v":{"v":24,"d":"$24.00"}},0,{"v":24,"d":"$ 24.00"},{"$f":"Tabla14253[[#This Row],[EFECTIVO]]+Tabla14253[[#This Row],[TRANSFERENCIA]]","v":{"v":24,"d":"$ 24.00"}},"CANCELADO",{"$f":"Tabla14253[[#This Row],[VALOR A PAGAR]]-Tabla14253[[#This Row],[VALOR CANCELADO]]","v":0},{"$f":"Tabla14253[[#This Row],[VALOR A PAGAR]]*0.5","v":{"v":12,"d":"$ 12.00"}},{"$f":"Tabla14253[[#This Row],[VALOR A PAGAR]]-Tabla14253[[#This Row],[COSTO]]","v":{"v":12,"d":"$ 12.00"}}]
["2024-09-24","DOJANG TKD MELO",4,{"v":2,"d":"$ 2.00"},{"$f":"Tabla14253[[#This Row],[CANT.]]*Tabla14253[[#This Row],[PRECIO UNITARIO]]","v":{"v":8,"d":"$8.00"}},0,{"v":8,"d":"$ 8.00"},{"$f":"Tabla14253[[#This Row],[EFECTIVO]]+Tabla14253[[#This Row],[TRANSFERENCIA]]","v":{"v":8,"d":"$ 8.00"}},"CANCELADO",{"$f":"Tabla14253[[#This Row],[VALOR A PAGAR]]-Tabla14253[[#This Row],[VALOR CANCELADO]]","v":0},{"$f":"Tabla14253[[#This Row],[VALOR A PAGAR]]*0.5","v":{"v":4,"d":"$ 4.00"}},{"$f":"Tabla14253[[#This Row],[VALOR A PAGAR]]-Tabla14253[[#This Row],[COSTO]]","v":{"v":4,"d":"$ 4.00"}}]
["2024-09-26","TAE KING'S",6,{"v":2,"d":"$ 2.00"},{"$f":"Tabla14253[[#This Row],[CANT.]]*Tabla14253[[#This Row],[PRECIO UNITARIO]]","v":{"v":12,"d":"$12.00"}},0,{"v":12,"d":"$ 12.00"},{"$f":"Tabla14253[[#This Row],[EFECTIVO]]+Tabla14253[[#This Row],[TRANSFERENCIA]]","v":{"v":12,"d":"$ 12.00"}},"CANCELADO",{"$f":"Tabla14253[[#This Row],[VALOR A PAGAR]]-Tabla14253[[#This Row],[VALOR CANCELADO]]","v":0},{"$f":"Tabla14253[[#This Row],[VALOR A PAGAR]]*0.5","v":{"v":6,"d":"$ 6.00"}},{"$f":"Tabla14253[[#This Row],[VALOR A PAGAR]]-Tabla14253[[#This Row],[COSTO]]","v":{"v":6,"d":"$ 6.00"}}]
["2024-09-27","KORYO",1,{"v":2,"d":"$ 2.00"},{"$f":"Tabla14253[[#This Row],[CANT.]]*Tabla14253[[#This Row],[PRECIO UNITARIO]]","v":{"v":2,"d":"$2.00"}},{"v":2,"d":"$ 2.00"},0,{"$f":"Tabla14253[[#This Row],[EFECTIVO]]+Tabla14253[[#This Row],[TRANSFERENCIA]]","v":{"v":2,"d":"$ 2.00"}},"CANCELADO",{"$f":"Tabla14253[[#This Row],[VALOR A PAGAR]]-Tabla14253[[#This Row],[VALOR CANCELADO]]","v":0},{"$f":"Tabla14253[[#This Row],[VALOR A PAGAR]]*0.5","v":{"v":1,"d":"$ 1.00"}},{"$f":"Tabla14253[[#This Row],[VALOR A PAGAR]]-Tabla14253[[#This Row],[COSTO]]","v":{"v":1,"d":"$ 1.00"}}]
["2024-10-01","ESPE",15,{"v":2,"d":"$ 2.00"},{"$f":"Tabla14253[[#This Row],[CANT.]]*Tabla14253[[#This Row],[PRECIO UNITARIO]]","v":{"v":30,"d":"$30.00"}},0,{"v":30,"d":"$ 30.00"},{"$f":"Tabla14253[[#This Row],[EFECTIVO]]+Tabla14253[[#This Row],[TRANSFERENCIA]]","v":{"v":30,"d":"$ 30.00"}},"CANCELADO",{"$f":"Tabla14253[[#This Row],[VALOR A PAGAR]]-Tabla14253[[#This Row],[VALOR CANCELADO]]","v":0},{"$f":"Tabla14253[[#This Row],[VALOR A PAGAR]]*0.5","v":{"v":15,"d":"$ 15.00"}},{"$f":"Tabla14253[[#This Row],[VALOR A PAGAR]]-Tabla14253[[#This Row],[COSTO]]","v":{"v":15,"d":"$ 15.00"}}]
["2024-10-01","BAEKJUL AYALAZ",19,{"v":2,"d":"$ 2.00"},{"$f":"Tabla14253[[#This Row],[CANT.]]*Tabla14253[[#This Row],[PRECIO UNITARIO]]","v":{"v":38,"d":"$38.00"}},0,{"v":38,"d":"$ 38.00"},{"$f":"Tabla14253[[#This Row],[EFECTIVO]]+Tabla14253[[#This Row],[TRANSFERENCIA]]","v":{"v":38,"d":"$ 38.00"}},"CANCELADO",{"$f":"Tabla14253[[#This Row],[VALOR A PAGAR]]-Tabla14253[[#This Row],[VALOR CANCELADO]]","v":0},{"$f":"Tabla14253[[#This Row],[VALOR A PAGAR]]*0.5","v":{"v":19,"d":"$ 19.00"}},{"$f":"Tabla14253[[#This Row],[VALOR A PAGAR]]-Tabla14253[[#This Row],[COSTO]]","v":{"v":19,"d":"$ 19.00"}}]
["2024-10-04","SEÚL GEDEÓN",1,{"v":2,"d":"$ 2.00"},{"$f":"Tabla14253[[#This Row],[CANT.]]*Tabla14253[[#This Row],[PRECIO UNITARIO]]","v":{"v":2,"d":"$2.00"}},{"v":2,"d":"$ 2.00"},0,{"$f":"Tabla14253[[#This Row],[EFECTIVO]]+Tabla14253[[#This Row],[TRANSFERENCIA]]","v":{"v":2,"d":"$ 2.00"}},"CANCELADO",{"$f":"Tabla14253[[#This Row],[VALOR A PAGAR]]-Tabla14253[[#This Row],[VALOR CANCELADO]]","v":0},{"$f":"Tabla14253[[#This Row],[VALOR A PAGAR]]*0.5","v":{"v":1,"d":"$ 1.00"}},{"$f":"Tabla14253[[#This Row],[VALOR A PAGAR]]-Tabla14253[[#This Row],[COSTO]]","v":{"v":1,"d":"$ 1.00"}}]
["2024-10-04","TAEKWONDO TRAINING CENTER",1,{"v":2,"d":"$ 2.00"},{"$f":"Tabla14253[[#This Row],[CANT.]]*Tabla14253[[#This Row],[PRECIO UNITARIO]]","v":{"v":2,"d":"$2.00"}},0,{"v":2,"d":"$ 2.00"},{"$f":"Tabla14253[[#This Row],[EFECTIVO]]+Tabla14253[[#This Row],[TRANSFERENCIA]]","v":{"v":2,"d":"$ 2.00"}},"CANCELADO",{"$f":"Tabla14253[[#This Row],[VALOR A PAGAR]]-Tabla14253[[#This Row],[VALOR CANCELADO]]","v":0},{"$f":"Tabla14253[[#This Row],[VALOR A PAGAR]]*0.5","v":{"v":1,"d":"$ 1.00"}},{"$f":"Tabla14253[[#This Row],[VALOR A PAGAR]]-Tabla14253[[#This Row],[COSTO]]","v":{"v":1,"d":"$ 1.00"}}]
["2024-10-08","JIDOKWAN",1,{"v":2,"d":"$ 2.00"},{"$f":"Tabla14253[[#This Row],[CANT.]]*Tabla14253[[#This Row],[PRECIO UNITARIO]]","v":{"v":2,"d":"$2.00"}},{"v":2,"d":"$ 2.00"},0,{"$f":"Tabla14253[[#This Row],[EFECTIVO]]+Tabla14253[[#This Row],[TRANSFERENCIA]]","v":{"v":2,"d":"$ 2.00"}},"CANCELADO",{"$f":"Tabla14253[[#This Row],[VALOR A PAGAR]]-Tabla14253[[#This Row],[VALOR CANCELADO]]","v":0},{"$f":"Tabla14253[[#This Row],[VALOR A PAGAR]]*0.5","v":{"v":1,"d":"$ 1.00"}},{"$f":"Tabla14253[[#This Row],[VALOR A PAGAR]]-Tabla14253[[#This Row],[COSTO]]","v":{"v":1,"d":"$ 1.00"}}]
["2024-10-08","MINOTAUROS",12,{"v":2,"d":"$ 2.00"},{"$f":"Tabla14253[[#This Row],[CANT.]]*Tabla14253[[#This Row],[PRECIO UNITARIO]]","v":{"v":24,"d":"$24.00"}},0,{"v":24,"d":"$ 24.00"},{"$f":"Tabla14253[[#This Row],[EFECTIVO]]+Tabla14253[[#This Row],[TRANSFERENCIA]]","v":{"v":24,"d":"$ 24.00"}},"CANCELADO",{"$f":"Tabla14253[[#This Row],[VALOR A PAGAR]]-Tabla14253[[#This Row],[VALOR CANCELADO]]","v":0},{"$f":"Tabla14253[[#This Row],[VALOR A PAGAR]]*0.5","v":{"v":12,"d":"$ 12.00"}},{"$f":"Tabla14253[[#This Row],[VALOR A PAGAR]]-Tabla14253[[#This Row],[COSTO]]","v":{"v":12,"d":"$ 12.00"}}]
["2024-10-09","KO AMÉRICA DRAGON FIRE",6,{"v":2,"d":"$ 2.00"},{"$f":"Tabla14253[[#This Row],[CANT.]]*Tabla14253[[#This Row],[PRECIO UNITARIO]]","v":{"v":12,"d":"$12.00"}},0,{"v":12,"d":"$ 12.00"},{"$f":"Tabla14253[[#This Row],[EFECTIVO]]+Tabla14253[[#This Row],[TRANSFERENCIA]]","v":{"v":12,"d":"$ 12.00"}},"CANCELADO",{"$f":"Tabla14253[[#This Row],[VALOR A PAGAR]]-Tabla14253[[#This Row],[VALOR CANCELADO]]","v":0},{"$f":"Tabla14253[[#This Row],[VALOR A PAGAR]]*0.5","v":{"v":6,"d":"$ 6.00"}},{"$f":"Tabla14253[[#This Row],[VALOR A PAGAR]]-Tabla14253[[#This Row],[COSTO]]","v":{"v":6,"d":"$ 6.00"}}]
["2024-10-16","TAEKWONDO TRAINING CENTER",22,{"v":2,"d":"$ 2.00"},{"$f":"Tabla14253[[#This Row],[CANT.]]*Tabla14253[[#This Row],[PRECIO UNITARIO]]","v":{"v":44,"d":"$44.00"}},0,{"v":44,"d":"$ 44.00"},{"$f":"Tabla14253[[#This Row],[EFECTIVO]]+Tabla14253[[#This Row],[TRANSFERENCIA]]","v":{"v":44,"d":"$ 44.00"}},"CANCELADO",{"$f":"Tabla14253[[#This Row],[VALOR A PAGAR]]-Tabla14253[[#This Row],[VALOR CANCELADO]]","v":0},{"$f":"Tabla14253[[#This Row],[VALOR A PAGAR]]*0.5","v":{"v":22,"d":"$ 22.00"}},{"$f":"Tabla14253[[#This Row],[VALOR A PAGAR]]-Tabla14253[[#This Row],[COSTO]]","v":{"v":22,"d":"$ 22.00"}}]
["2024-10-17","BAEKJUL ",6,{"v":2,"d":"$ 2.00"},{"$f":"Tabla14253[[#This Row],[CANT.]]*Tabla14253[[#This Row],[PRECIO UNITARIO]]","v":{"v":12,"d":"$12.00"}},0,{"v":12,"d":"$ 12.00"},{"$f":"Tabla14253[[#This Row],[EFECTIVO]]+Tabla14253[[#This Row],[TRANSFERENCIA]]","v":{"v":12,"d":"$ 12.00"}},"CANCELADO",{"$f":"Tabla14253[[#This Row],[VALOR A PAGAR]]-Tabla14253[[#This Row],[VALOR CANCELADO]]","v":0},{"$f":"Tabla14253[[#This Row],[VALOR A PAGAR]]*0.5","v":{"v":6,"d":"$ 6.00"}},{"$f":"Tabla14253[[#This Row],[VALOR A PAGAR]]-Tabla14253[[#This Row],[COSTO]]","v":{"v":6,"d":"$ 6.00"}}]
["2024-10-18","MICHAY DO",5,{"v":2,"d":"$ 2.00"},{"$f":"Tabla14253[[#This Row],[CANT.]]*Tabla14253[[#This Row],[PRECIO UNITARIO]]","v":{"v":10,"d":"$10.00"}},0,{"v":10,"d":"$ 10.00"},{"$f":"Tabla14253[[#This Row],[EFECTIVO]]+Tabla14253[[#This Row],[TRANSFERENCIA]]","v":{"v":10,"d":"$ 10.00"}},"CANCELADO",{"$f":"Tabla14253[[#This Row],[VALOR A PAGAR]]-Tabla14253[[#This Row],[VALOR CANCELADO]]","v":0},{"$f":"Tabla14253[[#This Row],[VALOR A PAGAR]]*0.5","v":{"v":5,"d":"$ 5.00"}},{"$f":"Tabla14253[[#This Row],[VALOR A PAGAR]]-Tabla14253[[#This Row],[COSTO]]","v":{"v":5,"d":"$ 5.00"}}]
["2024-10-18","BAEKJUL",1,{"v":2,"d":"$ 2.00"},{"$f":"Tabla14253[[#This Row],[CANT.]]*Tabla14253[[#This Row],[PRECIO UNITARIO]]","v":{"v":2,"d":"$2.00"}},0,{"v":2,"d":"$ 2.00"},{"$f":"Tabla14253[[#This Row],[EFECTIVO]]+Tabla14253[[#This Row],[TRANSFERENCIA]]","v":{"v":2,"d":"$ 2.00"}},"CANCELADO",{"$f":"Tabla14253[[#This Row],[VALOR A PAGAR]]-Tabla14253[[#This Row],[VALOR CANCELADO]]","v":0},{"$f":"Tabla14253[[#This Row],[VALOR A PAGAR]]*0.5","v":{"v":1,"d":"$ 1.00"}},{"$f":"Tabla14253[[#This Row],[VALOR A PAGAR]]-Tabla14253[[#This Row],[COSTO]]","v":{"v":1,"d":"$ 1.00"}}]
["2024-10-18","MILLENIUM",7,{"v":2,"d":"$ 2.00"},{"$f":"Tabla14253[[#This Row],[CANT.]]*Tabla14253[[#This Row],[PRECIO UNITARIO]]","v":{"v":14,"d":"$14.00"}},0,{"v":14,"d":"$ 14.00"},{"$f":"Tabla14253[[#This Row],[EFECTIVO]]+Tabla14253[[#This Row],[TRANSFERENCIA]]","v":{"v":14,"d":"$ 14.00"}},"CANCELADO",{"$f":"Tabla14253[[#This Row],[VALOR A PAGAR]]-Tabla14253[[#This Row],[VALOR CANCELADO]]","v":0},{"$f":"Tabla14253[[#This Row],[VALOR A PAGAR]]*0.5","v":{"v":7,"d":"$ 7.00"}},{"$f":"Tabla14253[[#This Row],[VALOR A PAGAR]]-Tabla14253[[#This Row],[COSTO]]","v":{"v":7,"d":"$ 7.00"}}]
["2024-10-22","DRAGON GYM",60,{"v":2,"d":"$ 2.00"},{"$f":"Tabla14253[[#This Row],[CANT.]]*Tabla14253[[#This Row],[PRECIO UNITARIO]]","v":{"v":120,"d":"$120.00"}},0,{"v":120,"d":"$ 120.00"},{"$f":"Tabla14253[[#This Row],[EFECTIVO]]+Tabla14253[[#This Row],[TRANSFERENCIA]]","v":{"v":120,"d":"$ 120.00"}},"CANCELADO",{"$f":"Tabla14253[[#This Row],[VALOR A PAGAR]]-Tabla14253[[#This Row],[VALOR CANCELADO]]","v":0},{"$f":"Tabla14253[[#This Row],[VALOR A PAGAR]]*0.5","v":{"v":60,"d":"$ 60.00"}},{"$f":"Tabla14253[[#This Row],[VALOR A PAGAR]]-Tabla14253[[#This Row],[COSTO]]","v":{"v":60,"d":"$ 60.00"}}]
["2024-10-22","DRAGON GYM",2,{"v":2,"d":"$ 2.00"},{"$f":"Tabla14253[[#This Row],[CANT.]]*Tabla14253[[#This Row],[PRECIO UNITARIO]]","v":{"v":4,"d":"$4.00"}},0,{"v":4,"d":"$ 4.00"},{"$f":"Tabla14253[[#This Row],[EFECTIVO]]+Tabla14253[[#This Row],[TRANSFERENCIA]]","v":{"v":4,"d":"$ 4.00"}},{"$f":"IF((E35=H35),\"CANCELADO\",\"SALDO PENDIENTE\")","v":"CANCELADO"},{"$f":"Tabla14253[[#This Row],[VALOR A PAGAR]]-Tabla14253[[#This Row],[VALOR CANCELADO]]","v":0},{"$f":"Tabla14253[[#This Row],[VALOR A PAGAR]]*0.5","v":{"v":2,"d":"$ 2.00"}},{"$f":"Tabla14253[[#This Row],[VALOR A PAGAR]]-Tabla14253[[#This Row],[COSTO]]","v":{"v":2,"d":"$ 2.00"}}]
["2024-10-22","JERATHEL",14,{"v":2,"d":"$ 2.00"},{"$f":"Tabla14253[[#This Row],[CANT.]]*Tabla14253[[#This Row],[PRECIO UNITARIO]]","v":{"v":28,"d":"$28.00"}},0,{"v":28,"d":"$ 28.00"},{"$f":"Tabla14253[[#This Row],[EFECTIVO]]+Tabla14253[[#This Row],[TRANSFERENCIA]]","v":{"v":28,"d":"$ 28.00"}},"CANCELADO",{"$f":"Tabla14253[[#This Row],[VALOR A PAGAR]]-Tabla14253[[#This Row],[VALOR CANCELADO]]","v":0},{"$f":"Tabla14253[[#This Row],[VALOR A PAGAR]]*0.5","v":{"v":14,"d":"$ 14.00"}},{"$f":"Tabla14253[[#This Row],[VALOR A PAGAR]]-Tabla14253[[#This Row],[COSTO]]","v":{"v":14,"d":"$ 14.00"}}]
["2024-10-25","DRAGON GYM",2,{"v":2,"d":"$ 2.00"},{"$f":"Tabla14253[[#This Row],[CANT.]]*Tabla14253[[#This Row],[PRECIO UNITARIO]]","v":{"v":4,"d":"$4.00"}},0,{"v":4,"d":"$ 4.00"},{"$f":"Tabla14253[[#This Row],[EFECTIVO]]+Tabla14253[[#This Row],[TRANSFERENCIA]]","v":{"v":4,"d":"$ 4.00"}},"CANCELADO",{"$f":"Tabla14253[[#This Row],[VALOR A PAGAR]]-Tabla14253[[#This Row],[VALOR CANCELADO]]","v":0},{"$f":"Tabla14253[[#This Row],[VALOR A PAGAR]]*0.5","v":{"v":2,"d":"$ 2.00"}},{"$f":"Tabla14253[[#This Row],[VALOR A PAGAR]]-Tabla14253[[#This Row],[COSTO]]","v":{"v":2,"d":"$ 2.00"}}]
["2024-10-25","KORYO DF DOJANG",1,{"v":2,"d":"$ 2.00"},{"$f":"Tabla14253[[#This Row],[CANT.]]*Tabla14253[[#This Row],[PRECIO UNITARIO]]","v":{"v":2,"d":"$2.00"}},{"v":2,"d":"$ 2.00"},0,{"$f":"Tabla14253[[#This Row],[EFECTIVO]]+Tabla14253[[#This Row],[TRANSFERENCIA]]","v":{"v":2,"d":"$ 2.00"}},"CANCELADO",{"$f":"Tabla14253[[#This Row],[VALOR A PAGAR]]-Tabla14253[[#This Row],[VALOR CANCELADO]]","v":0},{"$f":"Tabla14253[[#This Row],[VALOR A PAGAR]]*0.5","v":{"v":1,"d":"$ 1.00"}},{"$f":"Tabla14253[[#This Row],[VALOR A PAGAR]]-Tabla14253[[#This Row],[COSTO]]","v":{"v":1,"d":"$ 1.00"}}]
["2024-11-05","BAS PANTHERS",30,{"v":2,"d":"$ 2.00"},{"$f":"Tabla14253[[#This Row],[CANT.]]*Tabla14253[[#This Row],[PRECIO UNITARIO]]","v":{"v":60,"d":"$60.00"}},0,{"v":60,"d":"$ 60.00"},{"$f":"Tabla14253[[#This Row],[EFECTIVO]]+Tabla14253[[#This Row],[TRANSFERENCIA]]","v":{"v":60,"d":"$ 60.00"}},"CANCELADO",{"$f":"Tabla14253[[#This Row],[VALOR A PAGAR]]-Tabla14253[[#This Row],[VALOR CANCELADO]]","v":0},{"$f":"Tabla14253[[#This Row],[VALOR A PAGAR]]*0.5","v":{"v":30,"d":"$ 30.00"}},{"$f":"Tabla14253[[#This Row],[VALOR A PAGAR]]-Tabla14253[[#This Row],[COSTO]]","v":{"v":30,"d":"$ 30.00"}}]
["2024-11-06","BAS PANTHERS",1,{"v":2,"d":"$ 2.00"},{"$f":"Tabla14253[[#This Row],[CANT.]]*Tabla14253[[#This Row],[PRECIO UNITARIO]]","v":{"v":2,"d":"$2.00"}},{"v":2,"d":"$ 2.00"},0,{"$f":"Tabla14253[[#This Row],[EFECTIVO]]+Tabla14253[[#This Row],[TRANSFERENCIA]]","v":{"v":2,"d":"$ 2.00"}},"CANCELADO",{"$f":"Tabla14253[[#This Row],[VALOR A PAGAR]]-Tabla14253[[#This Row],[VALOR CANCELADO]]","v":0},{"$f":"Tabla14253[[#This Row],[VALOR A PAGAR]]*0.5","v":{"v":1,"d":"$ 1.00"}},{"$f":"Tabla14253[[#This Row],[VALOR A PAGAR]]-Tabla14253[[#This Row],[COSTO]]","v":{"v":1,"d":"$ 1.00"}}]
["2024-11-07","MIKIDO",20,{"v":2,"d":"$ 2.00"},{"$f":"Tabla14253[[#This Row],[CANT.]]*Tabla14253[[#This Row],[PRECIO UNITARIO]]","v":{"v":40,"d":"$40.00"}},0,{"v":40,"d":"$ 40.00"},{"$f":"Tabla14253[[#This Row],[EFECTIVO]]+Tabla14253[[#This Row],[TRANSFERENCIA]]","v":{"v":40,"d":"$ 40.00"}},"CANCELADO",{"$f":"Tabla14253[[#This Row],[VALOR A PAGAR]]-Tabla14253[[#This Row],[VALOR CANCELADO]]","v":0},{"$f":"Tabla14253[[#This Row],[VALOR A PAGAR]]*0.5","v":{"v":20,"d":"$ 20.00"}},{"$f":"Tabla14253[[#This Row],[VALOR A PAGAR]]-Tabla14253[[#This Row],[COSTO]]","v":{"v":20,"d":"$ 20.00"}}]
["2024-11-11","KYORUGUI GYM",27,{"v":2,"d":"$ 2.00"},{"$f":"Tabla14253[[#This Row],[CANT.]]*Tabla14253[[#This Row],[PRECIO UNITARIO]]","v":{"v":54,"d":"$54.00"}},0,{"v":54,"d":"$ 54.00"},{"$f":"Tabla14253[[#This Row],[EFECTIVO]]+Tabla14253[[#This Row],[TRANSFERENCIA]]","v":{"v":54,"d":"$ 54.00"}},"CANCELADO",{"$f":"Tabla14253[[#This Row],[VALOR A PAGAR]]-Tabla14253[[#This Row],[VALOR CANCELADO]]","v":0},{"$f":"Tabla14253[[#This Row],[VALOR A PAGAR]]*0.5","v":{"v":27,"d":"$ 27.00"}},{"$f":"Tabla14253[[#This Row],[VALOR A PAGAR]]-Tabla14253[[#This Row],[COSTO]]","v":{"v":27,"d":"$ 27.00"}}]
["2024-11-12","TAE BAEK ECUADOR JR.",2,{"v":2,"d":"$ 2.00"},{"$f":"Tabla14253[[#This Row],[CANT.]]*Tabla14253[[#This Row],[PRECIO UNITARIO]]","v":{"v":4,"d":"$4.00"}},0,{"v":4,"d":"$ 4.00"},{"$f":"Tabla14253[[#This Row],[EFECTIVO]]+Tabla14253[[#This Row],[TRANSFERENCIA]]","v":{"v":4,"d":"$ 4.00"}},"CANCELADO",{"$f":"Tabla14253[[#This Row],[VALOR A PAGAR]]-Tabla14253[[#This Row],[VALOR CANCELADO]]","v":0},{"$f":"Tabla14253[[#This Row],[VALOR A PAGAR]]*0.5","v":{"v":2,"d":"$ 2.00"}},{"$f":"Tabla14253[[#This Row],[VALOR A PAGAR]]-Tabla14253[[#This Row],[COSTO]]","v":{"v":2,"d":"$ 2.00"}}]
["2024-11-19","MIKIDO",6,{"v":2,"d":"$ 2.00"},{"$f":"Tabla14253[[#This Row],[CANT.]]*Tabla14253[[#This Row],[PRECIO UNITARIO]]","v":{"v":12,"d":"$12.00"}},0,{"v":12,"d":"$ 12.00"},{"$f":"Tabla14253[[#This Row],[EFECTIVO]]+Tabla14253[[#This Row],[TRANSFERENCIA]]","v":{"v":12,"d":"$ 12.00"}},"CANCELADO",{"$f":"Tabla14253[[#This Row],[VALOR A PAGAR]]-Tabla14253[[#This Row],[VALOR CANCELADO]]","v":0},{"$f":"Tabla14253[[#This Row],[VALOR A PAGAR]]*0.5","v":{"v":6,"d":"$ 6.00"}},{"$f":"Tabla14253[[#This Row],[VALOR A PAGAR]]-Tabla14253[[#This Row],[COSTO]]","v":{"v":6,"d":"$ 6.00"}}]
["2024-11-19","JOSEON LEGACY",40,{"v":2,"d":"$ 2.00"},{"$f":"Tabla14253[[#This Row],[CANT.]]*Tabla14253[[#This Row],[PRECIO UNITARIO]]","v":{"v":80,"d":"$80.00"}},0,{"v":80,"d":"$ 80.00"},{"$f":"Tabla14253[[#This Row],[EFECTIVO]]+Tabla14253[[#This Row],[TRANSFERENCIA]]","v":{"v":80,"d":"$ 80.00"}},"CANCELADO",{"$f":"Tabla14253[[#This Row],[VALOR A PAGAR]]-Tabla14253[[#This Row],[VALOR CANCELADO]]","v":0},{"$f":"Tabla14253[[#This Row],[VALOR A PAGAR]]*0.5","v":{"v":40,"d":"$ 40.00"}},{"$f":"Tabla14253[[#This Row],[VALOR A PAGAR]]-Tabla14253[[#This Row],[COSTO]]","v":{"v":40,"d":"$ 40.00"}}]
["2024-11-19","PALADINS MARCIAL CLUB",3,{"v":2,"d":"$ 2.00"},{"$f":"Tabla14253[[#This Row],[CANT.]]*Tabla14253[[#This Row],[PRECIO UNITARIO]]","v":{"v":6,"d":"$6.00"}},0,{"v":6,"d":"$ 6.00"},{"$f":"Tabla14253[[#This Row],[EFECTIVO]]+Tabla14253[[#This Row],[TRANSFERENCIA]]","v":{"v":6,"d":"$ 6.00"}},"CANCELADO",{"$f":"Tabla14253[[#This Row],[VALOR A PAGAR]]-Tabla14253[[#This Row],[VALOR CANCELADO]]","v":0},{"$f":"Tabla14253[[#This Row],[VALOR A PAGAR]]*0.5","v":{"v":3,"d":"$ 3.00"}},{"$f":"Tabla14253[[#This Row],[VALOR A PAGAR]]-Tabla14253[[#This Row],[COSTO]]","v":{"v":3,"d":"$ 3.00"}}]
["2024-11-19","GOYANG - IDEUL",1,{"v":2,"d":"$ 2.00"},{"$f":"Tabla14253[[#This Row],[CANT.]]*Tabla14253[[#This Row],[PRECIO UNITARIO]]","v":{"v":2,"d":"$2.00"}},0,{"v":2,"d":"$ 2.00"},{"$f":"Tabla14253[[#This Row],[EFECTIVO]]+Tabla14253[[#This Row],[TRANSFERENCIA]]","v":{"v":2,"d":"$ 2.00"}},"CANCELADO",{"$f":"Tabla14253[[#This Row],[VALOR A PAGAR]]-Tabla14253[[#This Row],[VALOR CANCELADO]]","v":0},{"$f":"Tabla14253[[#This Row],[VALOR A PAGAR]]*0.5","v":{"v":1,"d":"$ 1.00"}},{"$f":"Tabla14253[[#This Row],[VALOR A PAGAR]]-Tabla14253[[#This Row],[COSTO]]","v":{"v":1,"d":"$ 1.00"}}]
["2024-11-20","GOYANG - IDEUL",1,{"v":2,"d":"$ 2.00"},{"$f":"Tabla14253[[#This Row],[CANT.]]*Tabla14253[[#This Row],[PRECIO UNITARIO]]","v":{"v":2,"d":"$2.00"}},0,{"v":2,"d":"$ 2.00"},{"$f":"Tabla14253[[#This Row],[EFECTIVO]]+Tabla14253[[#This Row],[TRANSFERENCIA]]","v":{"v":2,"d":"$ 2.00"}},"CANCELADO",{"$f":"Tabla14253[[#This Row],[VALOR A PAGAR]]-Tabla14253[[#This Row],[VALOR CANCELADO]]","v":0},{"$f":"Tabla14253[[#This Row],[VALOR A PAGAR]]*0.5","v":{"v":1,"d":"$ 1.00"}},{"$f":"Tabla14253[[#This Row],[VALOR A PAGAR]]-Tabla14253[[#This Row],[COSTO]]","v":{"v":1,"d":"$ 1.00"}}]
["2024-11-21","TAE SHO KU TEAM VALLE",3,{"v":2,"d":"$ 2.00"},{"$f":"Tabla14253[[#This Row],[CANT.]]*Tabla14253[[#This Row],[PRECIO UNITARIO]]","v":{"v":6,"d":"$6.00"}},{"v":2,"d":"$ 2.00"},{"v":4,"d":"$ 4.00"},{"$f":"Tabla14253[[#This Row],[EFECTIVO]]+Tabla14253[[#This Row],[TRANSFERENCIA]]","v":{"v":6,"d":"$ 6.00"}},"CANCELADO",{"$f":"Tabla14253[[#This Row],[VALOR A PAGAR]]-Tabla14253[[#This Row],[VALOR CANCELADO]]","v":0},{"$f":"Tabla14253[[#This Row],[VALOR A PAGAR]]*0.5","v":{"v":3,"d":"$ 3.00"}},{"$f":"Tabla14253[[#This Row],[VALOR A PAGAR]]-Tabla14253[[#This Row],[COSTO]]","v":{"v":3,"d":"$ 3.00"}}]
["2024-11-22","ECUADOR",39,{"v":2,"d":"$ 2.00"},{"$f":"Tabla14253[[#This Row],[CANT.]]*Tabla14253[[#This Row],[PRECIO UNITARIO]]","v":{"v":78,"d":"$78.00"}},0,{"v":78,"d":"$ 78.00"},{"$f":"Tabla14253[[#This Row],[EFECTIVO]]+Tabla14253[[#This Row],[TRANSFERENCIA]]","v":{"v":78,"d":"$ 78.00"}},"CANCELADO",{"$f":"Tabla14253[[#This Row],[VALOR A PAGAR]]-Tabla14253[[#This Row],[VALOR CANCELADO]]","v":0},{"$f":"Tabla14253[[#This Row],[VALOR A PAGAR]]*0.5","v":{"v":39,"d":"$ 39.00"}},{"$f":"Tabla14253[[#This Row],[VALOR A PAGAR]]-Tabla14253[[#This Row],[COSTO]]","v":{"v":39,"d":"$ 39.00"}}]
["2024-11-25","TAE WOONG",2,{"v":2,"d":"$ 2.00"},{"$f":"Tabla14253[[#This Row],[CANT.]]*Tabla14253[[#This Row],[PRECIO UNITARIO]]","v":{"v":4,"d":"$4.00"}},0,{"v":4,"d":"$ 4.00"},{"$f":"Tabla14253[[#This Row],[EFECTIVO]]+Tabla14253[[#This Row],[TRANSFERENCIA]]","v":{"v":4,"d":"$ 4.00"}},"CANCELADO",{"$f":"Tabla14253[[#This Row],[VALOR A PAGAR]]-Tabla14253[[#This Row],[VALOR CANCELADO]]","v":0},{"$f":"Tabla14253[[#This Row],[VALOR A PAGAR]]*0.5","v":{"v":2,"d":"$ 2.00"}},{"$f":"Tabla14253[[#This Row],[VALOR A PAGAR]]-Tabla14253[[#This Row],[COSTO]]","v":{"v":2,"d":"$ 2.00"}}]
["2024-11-25","MARCIAL CLUB GRANDA",28,{"v":2,"d":"$ 2.00"},{"$f":"Tabla14253[[#This Row],[CANT.]]*Tabla14253[[#This Row],[PRECIO UNITARIO]]","v":{"v":56,"d":"$56.00"}},0,{"v":58,"d":"$ 58.00"},{"$f":"Tabla14253[[#This Row],[EFECTIVO]]+Tabla14253[[#This Row],[TRANSFERENCIA]]","v":{"v":58,"d":"$ 58.00"}},"SALDO A FAVOR DEL CLUB",{"$f":"Tabla14253[[#This Row],[VALOR A PAGAR]]-Tabla14253[[#This Row],[VALOR CANCELADO]]","v":{"v":-2,"d":"$ (2.00)"}},{"$f":"Tabla14253[[#This Row],[VALOR A PAGAR]]*0.5","v":{"v":28,"d":"$ 28.00"}},{"$f":"Tabla14253[[#This Row],[VALOR A PAGAR]]-Tabla14253[[#This Row],[COSTO]]","v":{"v":28,"d":"$ 28.00"}},"TIENE UN SALDO A FAVOR DE $2"]
["2024-11-26","ILYO M. P.",26,{"v":2,"d":"$ 2.00"},{"$f":"Tabla14253[[#This Row],[CANT.]]*Tabla14253[[#This Row],[PRECIO UNITARIO]]","v":{"v":52,"d":"$52.00"}},0,{"v":52,"d":"$ 52.00"},{"$f":"Tabla14253[[#This Row],[EFECTIVO]]+Tabla14253[[#This Row],[TRANSFERENCIA]]","v":{"v":52,"d":"$ 52.00"}},"CANCELADO",{"$f":"Tabla14253[[#This Row],[VALOR A PAGAR]]-Tabla14253[[#This Row],[VALOR CANCELADO]]","v":0},{"$f":"Tabla14253[[#This Row],[VALOR A PAGAR]]*0.5","v":{"v":26,"d":"$ 26.00"}},{"$f":"Tabla14253[[#This Row],[VALOR A PAGAR]]-Tabla14253[[#This Row],[COSTO]]","v":{"v":26,"d":"$ 26.00"}}]
["2024-11-27","SEUL LA ESTANCILLA",15,{"v":2,"d":"$ 2.00"},{"$f":"Tabla14253[[#This Row],[CANT.]]*Tabla14253[[#This Row],[PRECIO UNITARIO]]","v":{"v":30,"d":"$30.00"}},0,{"v":30,"d":"$ 30.00"},{"$f":"Tabla14253[[#This Row],[EFECTIVO]]+Tabla14253[[#This Row],[TRANSFERENCIA]]","v":{"v":30,"d":"$ 30.00"}},"CANCELADO",{"$f":"Tabla14253[[#This Row],[VALOR A PAGAR]]-Tabla14253[[#This Row],[VALOR CANCELADO]]","v":0},{"$f":"Tabla14253[[#This Row],[VALOR A PAGAR]]*0.5","v":{"v":15,"d":"$ 15.00"}},{"$f":"Tabla14253[[#This Row],[VALOR A PAGAR]]-Tabla14253[[#This Row],[COSTO]]","v":{"v":15,"d":"$ 15.00"}}]
["2024-11-27","SEUL YEONG GU",1,{"v":2,"d":"$ 2.00"},{"$f":"Tabla14253[[#This Row],[CANT.]]*Tabla14253[[#This Row],[PRECIO UNITARIO]]","v":{"v":2,"d":"$2.00"}},0,{"v":2,"d":"$ 2.00"},{"$f":"Tabla14253[[#This Row],[EFECTIVO]]+Tabla14253[[#This Row],[TRANSFERENCIA]]","v":{"v":2,"d":"$ 2.00"}},"CANCELADO",{"$f":"Tabla14253[[#This Row],[VALOR A PAGAR]]-Tabla14253[[#This Row],[VALOR CANCELADO]]","v":0},{"$f":"Tabla14253[[#This Row],[VALOR A PAGAR]]*0.5","v":{"v":1,"d":"$ 1.00"}},{"$f":"Tabla14253[[#This Row],[VALOR A PAGAR]]-Tabla14253[[#This Row],[COSTO]]","v":{"v":1,"d":"$ 1.00"}}]
["2024-11-27","SEUL CAPELO",9,{"v":2,"d":"$ 2.00"},{"$f":"Tabla14253[[#This Row],[CANT.]]*Tabla14253[[#This Row],[PRECIO UNITARIO]]","v":{"v":18,"d":"$18.00"}},0,{"v":18,"d":"$ 18.00"},{"$f":"Tabla14253[[#This Row],[EFECTIVO]]+Tabla14253[[#This Row],[TRANSFERENCIA]]","v":{"v":18,"d":"$ 18.00"}},"CANCELADO",{"$f":"Tabla14253[[#This Row],[VALOR A PAGAR]]-Tabla14253[[#This Row],[VALOR CANCELADO]]","v":0},{"$f":"Tabla14253[[#This Row],[VALOR A PAGAR]]*0.5","v":{"v":9,"d":"$ 9.00"}},{"$f":"Tabla14253[[#This Row],[VALOR A PAGAR]]-Tabla14253[[#This Row],[COSTO]]","v":{"v":9,"d":"$ 9.00"}}]
["2024-11-27","SEUL",1,{"v":2,"d":"$ 2.00"},{"$f":"Tabla14253[[#This Row],[CANT.]]*Tabla14253[[#This Row],[PRECIO UNITARIO]]","v":{"v":2,"d":"$2.00"}},0,{"v":2,"d":"$ 2.00"},{"$f":"Tabla14253[[#This Row],[EFECTIVO]]+Tabla14253[[#This Row],[TRANSFERENCIA]]","v":{"v":2,"d":"$ 2.00"}},"CANCELADO",{"$f":"Tabla14253[[#This Row],[VALOR A PAGAR]]-Tabla14253[[#This Row],[VALOR CANCELADO]]","v":0},{"$f":"Tabla14253[[#This Row],[VALOR A PAGAR]]*0.5","v":{"v":1,"d":"$ 1.00"}},{"$f":"Tabla14253[[#This Row],[VALOR A PAGAR]]-Tabla14253[[#This Row],[COSTO]]","v":{"v":1,"d":"$ 1.00"}}]
["2024-11-27","SEUL",60,{"v":2,"d":"$ 2.00"},{"$f":"Tabla14253[[#This Row],[CANT.]]*Tabla14253[[#This Row],[PRECIO UNITARIO]]","v":{"v":120,"d":"$120.00"}},0,{"v":120,"d":"$ 120.00"},{"$f":"Tabla14253[[#This Row],[EFECTIVO]]+Tabla14253[[#This Row],[TRANSFERENCIA]]","v":{"v":120,"d":"$ 120.00"}},"CANCELADO",{"$f":"Tabla14253[[#This Row],[VALOR A PAGAR]]-Tabla14253[[#This Row],[VALOR CANCELADO]]","v":0},{"$f":"Tabla14253[[#This Row],[VALOR A PAGAR]]*0.5","v":{"v":60,"d":"$ 60.00"}},{"$f":"Tabla14253[[#This Row],[VALOR A PAGAR]]-Tabla14253[[#This Row],[COSTO]]","v":{"v":60,"d":"$ 60.00"}}]
["2024-11-27","FITTKWONDO MEJÍA ",5,{"v":2,"d":"$ 2.00"},{"$f":"Tabla14253[[#This Row],[CANT.]]*Tabla14253[[#This Row],[PRECIO UNITARIO]]","v":{"v":10,"d":"$10.00"}},0,{"v":10,"d":"$ 10.00"},{"$f":"Tabla14253[[#This Row],[EFECTIVO]]+Tabla14253[[#This Row],[TRANSFERENCIA]]","v":{"v":10,"d":"$ 10.00"}},"CANCELADO",{"$f":"Tabla14253[[#This Row],[VALOR A PAGAR]]-Tabla14253[[#This Row],[VALOR CANCELADO]]","v":0},{"$f":"Tabla14253[[#This Row],[VALOR A PAGAR]]*0.5","v":{"v":5,"d":"$ 5.00"}},{"$f":"Tabla14253[[#This Row],[VALOR A PAGAR]]-Tabla14253[[#This Row],[COSTO]]","v":{"v":5,"d":"$ 5.00"}}]
["2024-11-29","PYONGYANG",17,{"v":2,"d":"$ 2.00"},{"$f":"Tabla14253[[#This Row],[CANT.]]*Tabla14253[[#This Row],[PRECIO UNITARIO]]","v":{"v":34,"d":"$34.00"}},0,{"v":34,"d":"$ 34.00"},{"$f":"Tabla14253[[#This Row],[EFECTIVO]]+Tabla14253[[#This Row],[TRANSFERENCIA]]","v":{"v":34,"d":"$ 34.00"}},"CANCELADO",{"$f":"Tabla14253[[#This Row],[VALOR A PAGAR]]-Tabla14253[[#This Row],[VALOR CANCELADO]]","v":0},{"$f":"Tabla14253[[#This Row],[VALOR A PAGAR]]*0.5","v":{"v":17,"d":"$ 17.00"}},{"$f":"Tabla14253[[#This Row],[VALOR A PAGAR]]-Tabla14253[[#This Row],[COSTO]]","v":{"v":17,"d":"$ 17.00"}}]
["2024-11-29","HUANG TOP GYM",5,{"v":2,"d":"$ 2.00"},{"$f":"Tabla14253[[#This Row],[CANT.]]*Tabla14253[[#This Row],[PRECIO UNITARIO]]","v":{"v":10,"d":"$10.00"}},0,{"v":10,"d":"$ 10.00"},{"$f":"Tabla14253[[#This Row],[EFECTIVO]]+Tabla14253[[#This Row],[TRANSFERENCIA]]","v":{"v":10,"d":"$ 10.00"}},"CANCELADO",{"$f":"Tabla14253[[#This Row],[VALOR A PAGAR]]-Tabla14253[[#This Row],[VALOR CANCELADO]]","v":0},{"$f":"Tabla14253[[#This Row],[VALOR A PAGAR]]*0.5","v":{"v":5,"d":"$ 5.00"}},{"$f":"Tabla14253[[#This Row],[VALOR A PAGAR]]-Tabla14253[[#This Row],[COSTO]]","v":{"v":5,"d":"$ 5.00"}}]
["2024-11-29","TEAM TAURO",32,{"v":2,"d":"$ 2.00"},{"$f":"Tabla14253[[#This Row],[CANT.]]*Tabla14253[[#This Row],[PRECIO UNITARIO]]","v":{"v":64,"d":"$64.00"}},0,{"v":44,"d":"$ 44.00"},{"$f":"Tabla14253[[#This Row],[EFECTIVO]]+Tabla14253[[#This Row],[TRANSFERENCIA]]","v":{"v":44,"d":"$ 44.00"}},"SALDO PENDIENTE",{"$f":"Tabla14253[[#This Row],[VALOR A PAGAR]]-Tabla14253[[#This Row],[VALOR CANCELADO]]","v":{"v":20,"d":"$ 20.00"}},{"$f":"Tabla14253[[#This Row],[VALOR A PAGAR]]*0.5","v":{"v":32,"d":"$ 32.00"}},{"$f":"Tabla14253[[#This Row],[VALOR A PAGAR]]-Tabla14253[[#This Row],[COSTO]]","v":{"v":32,"d":"$ 32.00"}},"POR PAGAR $20"]
["2024-12-02","SEUL CARAPUNGO",17,{"v":2,"d":"$ 2.00"},{"$f":"Tabla14253[[#This Row],[CANT.]]*Tabla14253[[#This Row],[PRECIO UNITARIO]]","v":{"v":34,"d":"$34.00"}},0,{"v":34,"d":"$ 34.00"},{"$f":"Tabla14253[[#This Row],[EFECTIVO]]+Tabla14253[[#This Row],[TRANSFERENCIA]]","v":{"v":34,"d":"$ 34.00"}},"CANCELADO",{"$f":"Tabla14253[[#This Row],[VALOR A PAGAR]]-Tabla14253[[#This Row],[VALOR CANCELADO]]","v":0},{"$f":"Tabla14253[[#This Row],[VALOR A PAGAR]]*0.5","v":{"v":17,"d":"$ 17.00"}},{"$f":"Tabla14253[[#This Row],[VALOR A PAGAR]]-Tabla14253[[#This Row],[COSTO]]","v":{"v":17,"d":"$ 17.00"}}]
["2024-12-02","TAE BAEK ECUADOR ",2,{"v":2,"d":"$ 2.00"},{"$f":"Tabla14253[[#This Row],[CANT.]]*Tabla14253[[#This Row],[PRECIO UNITARIO]]","v":{"v":4,"d":"$4.00"}},0,{"v":4,"d":"$ 4.00"},{"$f":"Tabla14253[[#This Row],[EFECTIVO]]+Tabla14253[[#This Row],[TRANSFERENCIA]]","v":{"v":4,"d":"$ 4.00"}},"CANCELADO",{"$f":"Tabla14253[[#This Row],[VALOR A PAGAR]]-Tabla14253[[#This Row],[VALOR CANCELADO]]","v":0},{"$f":"Tabla14253[[#This Row],[VALOR A PAGAR]]*0.5","v":{"v":2,"d":"$ 2.00"}},{"$f":"Tabla14253[[#This Row],[VALOR A PAGAR]]-Tabla14253[[#This Row],[COSTO]]","v":{"v":2,"d":"$ 2.00"}}]
["2024-12-02","SAN FRANCISCO TIGRES",19,{"v":2,"d":"$ 2.00"},{"$f":"Tabla14253[[#This Row],[CANT.]]*Tabla14253[[#This Row],[PRECIO UNITARIO]]","v":{"v":38,"d":"$38.00"}},0,{"v":38,"d":"$ 38.00"},{"$f":"Tabla14253[[#This Row],[EFECTIVO]]+Tabla14253[[#This Row],[TRANSFERENCIA]]","v":{"v":38,"d":"$ 38.00"}},"CANCELADO",{"$f":"Tabla14253[[#This Row],[VALOR A PAGAR]]-Tabla14253[[#This Row],[VALOR CANCELADO]]","v":0},{"$f":"Tabla14253[[#This Row],[VALOR A PAGAR]]*0.5","v":{"v":19,"d":"$ 19.00"}},{"$f":"Tabla14253[[#This Row],[VALOR A PAGAR]]-Tabla14253[[#This Row],[COSTO]]","v":{"v":19,"d":"$ 19.00"}},"PAGO EN DOS DEPÓSITO"]
["2024-12-03","SEUL CHUNG UI",32,{"v":2,"d":"$ 2.00"},{"$f":"Tabla14253[[#This Row],[CANT.]]*Tabla14253[[#This Row],[PRECIO UNITARIO]]","v":{"v":64,"d":"$64.00"}},0,{"v":64,"d":"$ 64.00"},{"$f":"Tabla14253[[#This Row],[EFECTIVO]]+Tabla14253[[#This Row],[TRANSFERENCIA]]","v":{"v":64,"d":"$ 64.00"}},"CANCELADO",{"$f":"Tabla14253[[#This Row],[VALOR A PAGAR]]-Tabla14253[[#This Row],[VALOR CANCELADO]]","v":0},{"$f":"Tabla14253[[#This Row],[VALOR A PAGAR]]*0.5","v":{"v":32,"d":"$ 32.00"}},{"$f":"Tabla14253[[#This Row],[VALOR A PAGAR]]-Tabla14253[[#This Row],[COSTO]]","v":{"v":32,"d":"$ 32.00"}}]
["2024-12-03","SEUL YEONG GU ",42,{"v":2,"d":"$ 2.00"},{"$f":"Tabla14253[[#This Row],[CANT.]]*Tabla14253[[#This Row],[PRECIO UNITARIO]]","v":{"v":84,"d":"$84.00"}},0,{"v":84,"d":"$ 84.00"},{"$f":"Tabla14253[[#This Row],[EFECTIVO]]+Tabla14253[[#This Row],[TRANSFERENCIA]]","v":{"v":84,"d":"$ 84.00"}},{"$f":"IF((E67=H67),\"CANCELADO\",\"SALDO PENDIENTE\")","v":"CANCELADO"},{"$f":"Tabla14253[[#This Row],[VALOR A PAGAR]]-Tabla14253[[#This Row],[VALOR CANCELADO]]","v":0},{"$f":"Tabla14253[[#This Row],[VALOR A PAGAR]]*0.5","v":{"v":42,"d":"$ 42.00"}},{"$f":"Tabla14253[[#This Row],[VALOR A PAGAR]]-Tabla14253[[#This Row],[COSTO]]","v":{"v":42,"d":"$ 42.00"}}]
["2024-12-03","EQUILIBRIO",16,{"v":2,"d":"$ 2.00"},{"$f":"Tabla14253[[#This Row],[CANT.]]*Tabla14253[[#This Row],[PRECIO UNITARIO]]","v":{"v":32,"d":"$32.00"}},0,{"v":32,"d":"$ 32.00"},{"$f":"Tabla14253[[#This Row],[EFECTIVO]]+Tabla14253[[#This Row],[TRANSFERENCIA]]","v":{"v":32,"d":"$ 32.00"}},"CANCELADO",{"$f":"Tabla14253[[#This Row],[VALOR A PAGAR]]-Tabla14253[[#This Row],[VALOR CANCELADO]]","v":0},{"$f":"Tabla14253[[#This Row],[VALOR A PAGAR]]*0.5","v":{"v":16,"d":"$ 16.00"}},{"$f":"Tabla14253[[#This Row],[VALOR A PAGAR]]-Tabla14253[[#This Row],[COSTO]]","v":{"v":16,"d":"$ 16.00"}}]
["2024-12-03","ILYO M. P.",3,{"v":2,"d":"$ 2.00"},{"$f":"Tabla14253[[#This Row],[CANT.]]*Tabla14253[[#This Row],[PRECIO UNITARIO]]","v":{"v":6,"d":"$6.00"}},0,{"v":7.5,"d":"$ 7.50"},{"$f":"Tabla14253[[#This Row],[EFECTIVO]]+Tabla14253[[#This Row],[TRANSFERENCIA]]","v":{"v":7.5,"d":"$ 7.50"}},"SALDO A FAVOR DEL CLUB",{"$f":"Tabla14253[[#This Row],[VALOR A PAGAR]]-Tabla14253[[#This Row],[VALOR CANCELADO]]","v":{"v":-1.5,"d":"$ (1.50)"}},{"$f":"Tabla14253[[#This Row],[VALOR A PAGAR]]*0.5","v":{"v":3,"d":"$ 3.00"}},{"$f":"Tabla14253[[#This Row],[VALOR A PAGAR]]-Tabla14253[[#This Row],[COSTO]]","v":{"v":3,"d":"$ 3.00"}},"TIENE UN SALDO A FAVOR DE $1,5"]
["2024-12-03","TAEGUK JUCARO",1,{"v":2,"d":"$ 2.00"},{"$f":"Tabla14253[[#This Row],[CANT.]]*Tabla14253[[#This Row],[PRECIO UNITARIO]]","v":{"v":2,"d":"$2.00"}},0,{"v":2,"d":"$ 2.00"},{"$f":"Tabla14253[[#This Row],[EFECTIVO]]+Tabla14253[[#This Row],[TRANSFERENCIA]]","v":{"v":2,"d":"$ 2.00"}},"CANCELADO",{"$f":"Tabla14253[[#This Row],[VALOR A PAGAR]]-Tabla14253[[#This Row],[VALOR CANCELADO]]","v":0},{"$f":"Tabla14253[[#This Row],[VALOR A PAGAR]]*0.5","v":{"v":1,"d":"$ 1.00"}},{"$f":"Tabla14253[[#This Row],[VALOR A PAGAR]]-Tabla14253[[#This Row],[COSTO]]","v":{"v":1,"d":"$ 1.00"}}]
["2024-12-04","SHOGUN",34,{"v":2,"d":"$ 2.00"},{"$f":"Tabla14253[[#This Row],[CANT.]]*Tabla14253[[#This Row],[PRECIO UNITARIO]]","v":{"v":68,"d":"$68.00"}},0,{"v":68,"d":"$ 68.00"},{"$f":"Tabla14253[[#This Row],[EFECTIVO]]+Tabla14253[[#This Row],[TRANSFERENCIA]]","v":{"v":68,"d":"$ 68.00"}},"CANCELADO",{"$f":"Tabla14253[[#This Row],[VALOR A PAGAR]]-Tabla14253[[#This Row],[VALOR CANCELADO]]","v":0},{"$f":"Tabla14253[[#This Row],[VALOR A PAGAR]]*0.5","v":{"v":34,"d":"$ 34.00"}},{"$f":"Tabla14253[[#This Row],[VALOR A PAGAR]]-Tabla14253[[#This Row],[COSTO]]","v":{"v":34,"d":"$ 34.00"}},"PAGO EN DOS DEPÓSITOS"]
["2024-12-04","KYORUGUI GYM",2,{"v":2,"d":"$ 2.00"},{"$f":"Tabla14253[[#This Row],[CANT.]]*Tabla14253[[#This Row],[PRECIO UNITARIO]]","v":{"v":4,"d":"$4.00"}},0,{"v":4,"d":"$ 4.00"},{"$f":"Tabla14253[[#This Row],[EFECTIVO]]+Tabla14253[[#This Row],[TRANSFERENCIA]]","v":{"v":4,"d":"$ 4.00"}},"CANCELADO",{"$f":"Tabla14253[[#This Row],[VALOR A PAGAR]]-Tabla14253[[#This Row],[VALOR CANCELADO]]","v":0},{"$f":"Tabla14253[[#This Row],[VALOR A PAGAR]]*0.5","v":{"v":2,"d":"$ 2.00"}},{"$f":"Tabla14253[[#This Row],[VALOR A PAGAR]]-Tabla14253[[#This Row],[COSTO]]","v":{"v":2,"d":"$ 2.00"}}]
["2024-12-04","TAE BAEK ECUADOR ",1,{"v":2,"d":"$ 2.00"},{"$f":"Tabla14253[[#This Row],[CANT.]]*Tabla14253[[#This Row],[PRECIO UNITARIO]]","v":{"v":2,"d":"$2.00"}},0,{"v":2,"d":"$ 2.00"},{"$f":"Tabla14253[[#This Row],[EFECTIVO]]+Tabla14253[[#This Row],[TRANSFERENCIA]]","v":{"v":2,"d":"$ 2.00"}},"CANCELADO",{"$f":"Tabla14253[[#This Row],[VALOR A PAGAR]]-Tabla14253[[#This Row],[VALOR CANCELADO]]","v":0},{"$f":"Tabla14253[[#This Row],[VALOR A PAGAR]]*0.5","v":{"v":1,"d":"$ 1.00"}},{"$f":"Tabla14253[[#This Row],[VALOR A PAGAR]]-Tabla14253[[#This Row],[COSTO]]","v":{"v":1,"d":"$ 1.00"}}]
["2024-12-04","APOLO",47,{"v":2,"d":"$ 2.00"},{"$f":"Tabla14253[[#This Row],[CANT.]]*Tabla14253[[#This Row],[PRECIO UNITARIO]]","v":{"v":94,"d":"$94.00"}},0,{"v":94,"d":"$ 94.00"},{"$f":"Tabla14253[[#This Row],[EFECTIVO]]+Tabla14253[[#This Row],[TRANSFERENCIA]]","v":{"v":94,"d":"$ 94.00"}},"CANCELADO",{"$f":"Tabla14253[[#This Row],[VALOR A PAGAR]]-Tabla14253[[#This Row],[VALOR CANCELADO]]","v":0},{"$f":"Tabla14253[[#This Row],[VALOR A PAGAR]]*0.5","v":{"v":47,"d":"$ 47.00"}},{"$f":"Tabla14253[[#This Row],[VALOR A PAGAR]]-Tabla14253[[#This Row],[COSTO]]","v":{"v":47,"d":"$ 47.00"}},"PAGO EN TRES DEPÓSITOS"]
["2024-12-04","JI TAE",2,{"v":2,"d":"$ 2.00"},{"$f":"Tabla14253[[#This Row],[CANT.]]*Tabla14253[[#This Row],[PRECIO UNITARIO]]","v":{"v":4,"d":"$4.00"}},0,{"v":4,"d":"$ 4.00"},{"$f":"Tabla14253[[#This Row],[EFECTIVO]]+Tabla14253[[#This Row],[TRANSFERENCIA]]","v":{"v":4,"d":"$ 4.00"}},"CANCELADO",{"$f":"Tabla14253[[#This Row],[VALOR A PAGAR]]-Tabla14253[[#This Row],[VALOR CANCELADO]]","v":0},{"$f":"Tabla14253[[#This Row],[VALOR A PAGAR]]*0.5","v":{"v":2,"d":"$ 2.00"}},{"$f":"Tabla14253[[#This Row],[VALOR A PAGAR]]-Tabla14253[[#This Row],[COSTO]]","v":{"v":2,"d":"$ 2.00"}}]
["2024-12-04","DRAGON LEE GYM",2,{"v":2,"d":"$ 2.00"},{"$f":"Tabla14253[[#This Row],[CANT.]]*Tabla14253[[#This Row],[PRECIO UNITARIO]]","v":{"v":4,"d":"$4.00"}},0,{"v":4,"d":"$ 4.00"},{"$f":"Tabla14253[[#This Row],[EFECTIVO]]+Tabla14253[[#This Row],[TRANSFERENCIA]]","v":{"v":4,"d":"$ 4.00"}},"CANCELADO",{"$f":"Tabla14253[[#This Row],[VALOR A PAGAR]]-Tabla14253[[#This Row],[VALOR CANCELADO]]","v":0},{"$f":"Tabla14253[[#This Row],[VALOR A PAGAR]]*0.5","v":{"v":2,"d":"$ 2.00"}},{"$f":"Tabla14253[[#This Row],[VALOR A PAGAR]]-Tabla14253[[#This Row],[COSTO]]","v":{"v":2,"d":"$ 2.00"}}]
["2024-12-04","SEUL GEDEON",20,{"v":2,"d":"$ 2.00"},{"$f":"Tabla14253[[#This Row],[CANT.]]*Tabla14253[[#This Row],[PRECIO UNITARIO]]","v":{"v":40,"d":"$40.00"}},0,{"v":40,"d":"$ 40.00"},{"$f":"Tabla14253[[#This Row],[EFECTIVO]]+Tabla14253[[#This Row],[TRANSFERENCIA]]","v":{"v":40,"d":"$ 40.00"}},"CANCELADO",{"$f":"Tabla14253[[#This Row],[VALOR A PAGAR]]-Tabla14253[[#This Row],[VALOR CANCELADO]]","v":0},{"$f":"Tabla14253[[#This Row],[VALOR A PAGAR]]*0.5","v":{"v":20,"d":"$ 20.00"}},{"$f":"Tabla14253[[#This Row],[VALOR A PAGAR]]-Tabla14253[[#This Row],[COSTO]]","v":{"v":20,"d":"$ 20.00"}}]
["2024-12-05","CAMU",44,{"v":2,"d":"$ 2.00"},{"$f":"Tabla14253[[#This Row],[CANT.]]*Tabla14253[[#This Row],[PRECIO UNITARIO]]","v":{"v":88,"d":"$88.00"}},0,{"v":88,"d":"$ 88.00"},{"$f":"Tabla14253[[#This Row],[EFECTIVO]]+Tabla14253[[#This Row],[TRANSFERENCIA]]","v":{"v":88,"d":"$ 88.00"}},"CANCELADO",{"$f":"Tabla14253[[#This Row],[VALOR A PAGAR]]-Tabla14253[[#This Row],[VALOR CANCELADO]]","v":0},{"$f":"Tabla14253[[#This Row],[VALOR A PAGAR]]*0.5","v":{"v":44,"d":"$ 44.00"}},{"$f":"Tabla14253[[#This Row],[VALOR A PAGAR]]-Tabla14253[[#This Row],[COSTO]]","v":{"v":44,"d":"$ 44.00"}}]
["2024-12-05","KOREAN DRAGON",26,{"v":2,"d":"$ 2.00"},{"$f":"Tabla14253[[#This Row],[CANT.]]*Tabla14253[[#This Row],[PRECIO UNITARIO]]","v":{"v":52,"d":"$52.00"}},0,{"v":52,"d":"$ 52.00"},{"$f":"Tabla14253[[#This Row],[EFECTIVO]]+Tabla14253[[#This Row],[TRANSFERENCIA]]","v":{"v":52,"d":"$ 52.00"}},"CANCELADO",{"$f":"Tabla14253[[#This Row],[VALOR A PAGAR]]-Tabla14253[[#This Row],[VALOR CANCELADO]]","v":0},{"$f":"Tabla14253[[#This Row],[VALOR A PAGAR]]*0.5","v":{"v":26,"d":"$ 26.00"}},{"$f":"Tabla14253[[#This Row],[VALOR A PAGAR]]-Tabla14253[[#This Row],[COSTO]]","v":{"v":26,"d":"$ 26.00"}}]
["2024-12-05","TAE KING'S",2,{"v":2,"d":"$ 2.00"},{"$f":"Tabla14253[[#This Row],[CANT.]]*Tabla14253[[#This Row],[PRECIO UNITARIO]]","v":{"v":4,"d":"$4.00"}},0,{"v":4,"d":"$ 4.00"},{"$f":"Tabla14253[[#This Row],[EFECTIVO]]+Tabla14253[[#This Row],[TRANSFERENCIA]]","v":{"v":4,"d":"$ 4.00"}},"CANCELADO",{"$f":"Tabla14253[[#This Row],[VALOR A PAGAR]]-Tabla14253[[#This Row],[VALOR CANCELADO]]","v":0},{"$f":"Tabla14253[[#This Row],[VALOR A PAGAR]]*0.5","v":{"v":2,"d":"$ 2.00"}},{"$f":"Tabla14253[[#This Row],[VALOR A PAGAR]]-Tabla14253[[#This Row],[COSTO]]","v":{"v":2,"d":"$ 2.00"}}]
["2024-12-08","BORJA'S LIONS",18,{"v":2,"d":"$ 2.00"},{"$f":"Tabla14253[[#This Row],[CANT.]]*Tabla14253[[#This Row],[PRECIO UNITARIO]]","v":{"v":36,"d":"$36.00"}},0,{"v":36,"d":"$ 36.00"},{"$f":"Tabla14253[[#This Row],[EFECTIVO]]+Tabla14253[[#This Row],[TRANSFERENCIA]]","v":{"v":36,"d":"$ 36.00"}},"CANCELADO",{"$f":"Tabla14253[[#This Row],[VALOR A PAGAR]]-Tabla14253[[#This Row],[VALOR CANCELADO]]","v":0},{"$f":"Tabla14253[[#This Row],[VALOR A PAGAR]]*0.5","v":{"v":18,"d":"$ 18.00"}},{"$f":"Tabla14253[[#This Row],[VALOR A PAGAR]]-Tabla14253[[#This Row],[COSTO]]","v":{"v":18,"d":"$ 18.00"}}]
["2024-12-09","TOTAL KOMBAT",26,{"v":2,"d":"$ 2.00"},{"$f":"Tabla14253[[#This Row],[CANT.]]*Tabla14253[[#This Row],[PRECIO UNITARIO]]","v":{"v":52,"d":"$52.00"}},0,{"v":65,"d":"$ 65.00"},{"$f":"Tabla14253[[#This Row],[EFECTIVO]]+Tabla14253[[#This Row],[TRANSFERENCIA]]","v":{"v":65,"d":"$ 65.00"}},"SALDO A FAVOR DEL CLUB",{"$f":"Tabla14253[[#This Row],[VALOR A PAGAR]]-Tabla14253[[#This Row],[VALOR CANCELADO]]","v":{"v":-13,"d":"$ (13.00)"}},{"$f":"Tabla14253[[#This Row],[VALOR A PAGAR]]*0.5","v":{"v":26,"d":"$ 26.00"}},{"$f":"Tabla14253[[#This Row],[VALOR A PAGAR]]-Tabla14253[[#This Row],[COSTO]]","v":{"v":26,"d":"$ 26.00"}}]
["2024-12-09","TOTAL KOMBAT RHINOS",33,{"v":2,"d":"$ 2.00"},{"$f":"Tabla14253[[#This Row],[CANT.]]*Tabla14253[[#This Row],[PRECIO UNITARIO]]","v":{"v":66,"d":"$66.00"}},0,{"v":85,"d":"$ 85.00"},{"$f":"Tabla14253[[#This Row],[EFECTIVO]]+Tabla14253[[#This Row],[TRANSFERENCIA]]","v":{"v":85,"d":"$ 85.00"}},"SALDO A FAVOR DEL CLUB",{"$f":"Tabla14253[[#This Row],[VALOR A PAGAR]]-Tabla14253[[#This Row],[VALOR CANCELADO]]","v":{"v":-19,"d":"$ (19.00)"}},{"$f":"Tabla14253[[#This Row],[VALOR A PAGAR]]*0.5","v":{"v":33,"d":"$ 33.00"}},{"$f":"Tabla14253[[#This Row],[VALOR A PAGAR]]-Tabla14253[[#This Row],[COSTO]]","v":{"v":33,"d":"$ 33.00"}}]
["2024-12-09","TKT - KUKKIWON C. C",4,{"v":2,"d":"$ 2.00"},{"$f":"Tabla14253[[#This Row],[CANT.]]*Tabla14253[[#This Row],[PRECIO UNITARIO]]","v":{"v":8,"d":"$8.00"}},0,{"v":10,"d":"$ 10.00"},{"$f":"Tabla14253[[#This Row],[EFECTIVO]]+Tabla14253[[#This Row],[TRANSFERENCIA]]","v":{"v":10,"d":"$ 10.00"}},"SALDO A FAVOR DEL CLUB",{"$f":"Tabla14253[[#This Row],[VALOR A PAGAR]]-Tabla14253[[#This Row],[VALOR CANCELADO]]","v":{"v":-2,"d":"$ (2.00)"}},{"$f":"Tabla14253[[#This Row],[VALOR A PAGAR]]*0.5","v":{"v":4,"d":"$ 4.00"}},{"$f":"Tabla14253[[#This Row],[VALOR A PAGAR]]-Tabla14253[[#This Row],[COSTO]]","v":{"v":4,"d":"$ 4.00"}}]
["2024-12-09","BAEKJUL",31,{"v":2,"d":"$ 2.00"},{"$f":"Tabla14253[[#This Row],[CANT.]]*Tabla14253[[#This Row],[PRECIO UNITARIO]]","v":{"v":62,"d":"$62.00"}},0,{"v":62,"d":"$ 62.00"},{"$f":"Tabla14253[[#This Row],[EFECTIVO]]+Tabla14253[[#This Row],[TRANSFERENCIA]]","v":{"v":62,"d":"$ 62.00"}},"CANCELADO",{"$f":"Tabla14253[[#This Row],[VALOR A PAGAR]]-Tabla14253[[#This Row],[VALOR CANCELADO]]","v":0},{"$f":"Tabla14253[[#This Row],[VALOR A PAGAR]]*0.5","v":{"v":31,"d":"$ 31.00"}},{"$f":"Tabla14253[[#This Row],[VALOR A PAGAR]]-Tabla14253[[#This Row],[COSTO]]","v":{"v":31,"d":"$ 31.00"}}]
["2024-12-09","ARES",26,{"v":2,"d":"$ 2.00"},{"$f":"Tabla14253[[#This Row],[CANT.]]*Tabla14253[[#This Row],[PRECIO UNITARIO]]","v":{"v":52,"d":"$52.00"}},0,{"v":52,"d":"$ 52.00"},{"$f":"Tabla14253[[#This Row],[EFECTIVO]]+Tabla14253[[#This Row],[TRANSFERENCIA]]","v":{"v":52,"d":"$ 52.00"}},"CANCELADO",{"$f":"Tabla14253[[#This Row],[VALOR A PAGAR]]-Tabla14253[[#This Row],[VALOR CANCELADO]]","v":0},{"$f":"Tabla14253[[#This Row],[VALOR A PAGAR]]*0.5","v":{"v":26,"d":"$ 26.00"}},{"$f":"Tabla14253[[#This Row],[VALOR A PAGAR]]-Tabla14253[[#This Row],[COSTO]]","v":{"v":26,"d":"$ 26.00"}},"PAGO EN DOS DEPÓSITOS"]
["2024-12-09","RAIG DE LLUM",16,{"v":2,"d":"$ 2.00"},{"$f":"Tabla14253[[#This Row],[CANT.]]*Tabla14253[[#This Row],[PRECIO UNITARIO]]","v":{"v":32,"d":"$32.00"}},0,{"v":32,"d":"$ 32.00"},{"$f":"Tabla14253[[#This Row],[EFECTIVO]]+Tabla14253[[#This Row],[TRANSFERENCIA]]","v":{"v":32,"d":"$ 32.00"}},"CANCELADO",{"$f":"Tabla14253[[#This Row],[VALOR A PAGAR]]-Tabla14253[[#This Row],[VALOR CANCELADO]]","v":0},{"$f":"Tabla14253[[#This Row],[VALOR A PAGAR]]*0.5","v":{"v":16,"d":"$ 16.00"}},{"$f":"Tabla14253[[#This Row],[VALOR A PAGAR]]-Tabla14253[[#This Row],[COSTO]]","v":{"v":16,"d":"$ 16.00"}}]
["2024-12-09","TAE DO ACADEMY",64,{"v":2,"d":"$ 2.00"},{"$f":"Tabla14253[[#This Row],[CANT.]]*Tabla14253[[#This Row],[PRECIO UNITARIO]]","v":{"v":128,"d":"$128.00"}},0,{"v":130,"d":"$ 130.00"},{"$f":"Tabla14253[[#This Row],[EFECTIVO]]+Tabla14253[[#This Row],[TRANSFERENCIA]]","v":{"v":130,"d":"$ 130.00"}},"SALDO A FAVOR DEL CLUB",{"$f":"Tabla14253[[#This Row],[VALOR A PAGAR]]-Tabla14253[[#This Row],[VALOR CANCELADO]]","v":{"v":-2,"d":"$ (2.00)"}},{"$f":"Tabla14253[[#This Row],[VALOR A PAGAR]]*0.5","v":{"v":64,"d":"$ 64.00"}},{"$f":"Tabla14253[[#This Row],[VALOR A PAGAR]]-Tabla14253[[#This Row],[COSTO]]","v":{"v":64,"d":"$ 64.00"}},"TIENE UN SALDO A FAVOR DE $2"]
["2024-12-10","KUKKIWON",2,{"v":2,"d":"$ 2.00"},{"$f":"Tabla14253[[#This Row],[CANT.]]*Tabla14253[[#This Row],[PRECIO UNITARIO]]","v":{"v":4,"d":"$4.00"}},0,{"v":4,"d":"$ 4.00"},{"$f":"Tabla14253[[#This Row],[EFECTIVO]]+Tabla14253[[#This Row],[TRANSFERENCIA]]","v":{"v":4,"d":"$ 4.00"}},"CANCELADO",{"$f":"Tabla14253[[#This Row],[VALOR A PAGAR]]-Tabla14253[[#This Row],[VALOR CANCELADO]]","v":0},{"$f":"Tabla14253[[#This Row],[VALOR A PAGAR]]*0.5","v":{"v":2,"d":"$ 2.00"}},{"$f":"Tabla14253[[#This Row],[VALOR A PAGAR]]-Tabla14253[[#This Row],[COSTO]]","v":{"v":2,"d":"$ 2.00"}}]
["2024-12-10","SURYUN",10,{"v":2,"d":"$ 2.00"},{"$f":"Tabla14253[[#This Row],[CANT.]]*Tabla14253[[#This Row],[PRECIO UNITARIO]]","v":{"v":20,"d":"$20.00"}},0,{"v":20,"d":"$ 20.00"},{"$f":"Tabla14253[[#This Row],[EFECTIVO]]+Tabla14253[[#This Row],[TRANSFERENCIA]]","v":{"v":20,"d":"$ 20.00"}},"CANCELADO",{"$f":"Tabla14253[[#This Row],[VALOR A PAGAR]]-Tabla14253[[#This Row],[VALOR CANCELADO]]","v":0},{"$f":"Tabla14253[[#This Row],[VALOR A PAGAR]]*0.5","v":{"v":10,"d":"$ 10.00"}},{"$f":"Tabla14253[[#This Row],[VALOR A PAGAR]]-Tabla14253[[#This Row],[COSTO]]","v":{"v":10,"d":"$ 10.00"}}]
["2024-12-10","BLUE DRAGONS",29,{"v":2,"d":"$ 2.00"},{"$f":"Tabla14253[[#This Row],[CANT.]]*Tabla14253[[#This Row],[PRECIO UNITARIO]]","v":{"v":58,"d":"$58.00"}},0,{"v":58,"d":"$ 58.00"},{"$f":"Tabla14253[[#This Row],[EFECTIVO]]+Tabla14253[[#This Row],[TRANSFERENCIA]]","v":{"v":58,"d":"$ 58.00"}},"CANCELADO",{"$f":"Tabla14253[[#This Row],[VALOR A PAGAR]]-Tabla14253[[#This Row],[VALOR CANCELADO]]","v":0},{"$f":"Tabla14253[[#This Row],[VALOR A PAGAR]]*0.5","v":{"v":29,"d":"$ 29.00"}},{"$f":"Tabla14253[[#This Row],[VALOR A PAGAR]]-Tabla14253[[#This Row],[COSTO]]","v":{"v":29,"d":"$ 29.00"}}]
["2024-12-10","LEÓN",14,{"v":2,"d":"$ 2.00"},{"$f":"Tabla14253[[#This Row],[CANT.]]*Tabla14253[[#This Row],[PRECIO UNITARIO]]","v":{"v":28,"d":"$28.00"}},0,{"v":28,"d":"$ 28.00"},{"$f":"Tabla14253[[#This Row],[EFECTIVO]]+Tabla14253[[#This Row],[TRANSFERENCIA]]","v":{"v":28,"d":"$ 28.00"}},"CANCELADO",{"$f":"Tabla14253[[#This Row],[VALOR A PAGAR]]-Tabla14253[[#This Row],[VALOR CANCELADO]]","v":0},{"$f":"Tabla14253[[#This Row],[VALOR A PAGAR]]*0.5","v":{"v":14,"d":"$ 14.00"}},{"$f":"Tabla14253[[#This Row],[VALOR A PAGAR]]-Tabla14253[[#This Row],[COSTO]]","v":{"v":14,"d":"$ 14.00"}},"PAGA EL 10-01-2025 FECHA EN LA QUE SE HACE EL TRÁMITE"]
["2024-12-10","SEUL LA ESTANCILLA",1,{"v":2,"d":"$ 2.00"},{"$f":"Tabla14253[[#This Row],[CANT.]]*Tabla14253[[#This Row],[PRECIO UNITARIO]]","v":{"v":2,"d":"$2.00"}},0,{"v":2,"d":"$ 2.00"},{"$f":"Tabla14253[[#This Row],[EFECTIVO]]+Tabla14253[[#This Row],[TRANSFERENCIA]]","v":{"v":2,"d":"$ 2.00"}},"CANCELADO",{"$f":"Tabla14253[[#This Row],[VALOR A PAGAR]]-Tabla14253[[#This Row],[VALOR CANCELADO]]","v":0},{"$f":"Tabla14253[[#This Row],[VALOR A PAGAR]]*0.5","v":{"v":1,"d":"$ 1.00"}},{"$f":"Tabla14253[[#This Row],[VALOR A PAGAR]]-Tabla14253[[#This Row],[COSTO]]","v":{"v":1,"d":"$ 1.00"}}]
["2024-12-11","YONG TIGER",10,{"v":2,"d":"$ 2.00"},{"$f":"Tabla14253[[#This Row],[CANT.]]*Tabla14253[[#This Row],[PRECIO UNITARIO]]","v":{"v":20,"d":"$20.00"}},0,{"v":20,"d":"$ 20.00"},{"$f":"Tabla14253[[#This Row],[EFECTIVO]]+Tabla14253[[#This Row],[TRANSFERENCIA]]","v":{"v":20,"d":"$ 20.00"}},"CANCELADO",{"$f":"Tabla14253[[#This Row],[VALOR A PAGAR]]-Tabla14253[[#This Row],[VALOR CANCELADO]]","v":0},{"$f":"Tabla14253[[#This Row],[VALOR A PAGAR]]*0.5","v":{"v":10,"d":"$ 10.00"}},{"$f":"Tabla14253[[#This Row],[VALOR A PAGAR]]-Tabla14253[[#This Row],[COSTO]]","v":{"v":10,"d":"$ 10.00"}},"JULIO 2024 FECHA DE CERTIFICADOS"]
["2024-12-11","YONG TIGER",15,{"v":2,"d":"$ 2.00"},{"$f":"Tabla14253[[#This Row],[CANT.]]*Tabla14253[[#This Row],[PRECIO UNITARIO]]","v":{"v":30,"d":"$30.00"}},0,{"v":30,"d":"$ 30.00"},{"$f":"Tabla14253[[#This Row],[EFECTIVO]]+Tabla14253[[#This Row],[TRANSFERENCIA]]","v":{"v":30,"d":"$ 30.00"}},"CANCELADO",{"$f":"Tabla14253[[#This Row],[VALOR A PAGAR]]-Tabla14253[[#This Row],[VALOR CANCELADO]]","v":0},{"$f":"Tabla14253[[#This Row],[VALOR A PAGAR]]*0.5","v":{"v":15,"d":"$ 15.00"}},{"$f":"Tabla14253[[#This Row],[VALOR A PAGAR]]-Tabla14253[[#This Row],[COSTO]]","v":{"v":15,"d":"$ 15.00"}},"DICIEMBRE 2024 FECHA DE CERTIFICADOS"]
["2024-12-12","DECIAP",83,{"v":2,"d":"$ 2.00"},{"$f":"Tabla14253[[#This Row],[CANT.]]*Tabla14253[[#This Row],[PRECIO UNITARIO]]","v":{"v":166,"d":"$166.00"}},0,{"v":166,"d":"$ 166.00"},{"$f":"Tabla14253[[#This Row],[EFECTIVO]]+Tabla14253[[#This Row],[TRANSFERENCIA]]","v":{"v":166,"d":"$ 166.00"}},"CANCELADO",{"$f":"Tabla14253[[#This Row],[VALOR A PAGAR]]-Tabla14253[[#This Row],[VALOR CANCELADO]]","v":0},{"$f":"Tabla14253[[#This Row],[VALOR A PAGAR]]*0.5","v":{"v":83,"d":"$ 83.00"}},{"$f":"Tabla14253[[#This Row],[VALOR A PAGAR]]-Tabla14253[[#This Row],[COSTO]]","v":{"v":83,"d":"$ 83.00"}}]
["2024-12-12","TAE WOONG",21,{"v":2,"d":"$ 2.00"},{"$f":"Tabla14253[[#This Row],[CANT.]]*Tabla14253[[#This Row],[PRECIO UNITARIO]]","v":{"v":42,"d":"$42.00"}},0,{"v":42,"d":"$ 42.00"},{"$f":"Tabla14253[[#This Row],[EFECTIVO]]+Tabla14253[[#This Row],[TRANSFERENCIA]]","v":{"v":42,"d":"$ 42.00"}},"CANCELADO",{"$f":"Tabla14253[[#This Row],[VALOR A PAGAR]]-Tabla14253[[#This Row],[VALOR CANCELADO]]","v":0},{"$f":"Tabla14253[[#This Row],[VALOR A PAGAR]]*0.5","v":{"v":21,"d":"$ 21.00"}},{"$f":"Tabla14253[[#This Row],[VALOR A PAGAR]]-Tabla14253[[#This Row],[COSTO]]","v":{"v":21,"d":"$ 21.00"}}]
["2024-12-12","KO AMÉRICA CAUPICHO",70,{"v":2,"d":"$ 2.00"},{"$f":"Tabla14253[[#This Row],[CANT.]]*Tabla14253[[#This Row],[PRECIO UNITARIO]]","v":{"v":140,"d":"$140.00"}},0,{"v":140,"d":"$ 140.00"},{"$f":"Tabla14253[[#This Row],[EFECTIVO]]+Tabla14253[[#This Row],[TRANSFERENCIA]]","v":{"v":140,"d":"$ 140.00"}},"CANCELADO",{"$f":"Tabla14253[[#This Row],[VALOR A PAGAR]]-Tabla14253[[#This Row],[VALOR CANCELADO]]","v":0},{"$f":"Tabla14253[[#This Row],[VALOR A PAGAR]]*0.5","v":{"v":70,"d":"$ 70.00"}},{"$f":"Tabla14253[[#This Row],[VALOR A PAGAR]]-Tabla14253[[#This Row],[COSTO]]","v":{"v":70,"d":"$ 70.00"}}]
["2024-12-13","FITTKWONDO MEJÍA ",1,{"v":2,"d":"$ 2.00"},{"$f":"Tabla14253[[#This Row],[CANT.]]*Tabla14253[[#This Row],[PRECIO UNITARIO]]","v":{"v":2,"d":"$2.00"}},0,{"v":2,"d":"$ 2.00"},{"$f":"Tabla14253[[#This Row],[EFECTIVO]]+Tabla14253[[#This Row],[TRANSFERENCIA]]","v":{"v":2,"d":"$ 2.00"}},{"$f":"IF((E99=H99),\"CANCELADO\",\"SALDO PENDIENTE\")","v":"CANCELADO"},{"$f":"Tabla14253[[#This Row],[VALOR A PAGAR]]-Tabla14253[[#This Row],[VALOR CANCELADO]]","v":0},{"$f":"Tabla14253[[#This Row],[VALOR A PAGAR]]*0.5","v":{"v":1,"d":"$ 1.00"}},{"$f":"Tabla14253[[#This Row],[VALOR A PAGAR]]-Tabla14253[[#This Row],[COSTO]]","v":{"v":1,"d":"$ 1.00"}}]
["2024-12-13","FIRST CLASS",9,{"v":2,"d":"$ 2.00"},{"$f":"Tabla14253[[#This Row],[CANT.]]*Tabla14253[[#This Row],[PRECIO UNITARIO]]","v":{"v":18,"d":"$18.00"}},0,{"v":18,"d":"$ 18.00"},{"$f":"Tabla14253[[#This Row],[EFECTIVO]]+Tabla14253[[#This Row],[TRANSFERENCIA]]","v":{"v":18,"d":"$ 18.00"}},"CANCELADO",{"$f":"Tabla14253[[#This Row],[VALOR A PAGAR]]-Tabla14253[[#This Row],[VALOR CANCELADO]]","v":0},{"$f":"Tabla14253[[#This Row],[VALOR A PAGAR]]*0.5","v":{"v":9,"d":"$ 9.00"}},{"$f":"Tabla14253[[#This Row],[VALOR A PAGAR]]-Tabla14253[[#This Row],[COSTO]]","v":{"v":9,"d":"$ 9.00"}}]
["2024-12-14","ASOTKD - P CHIMBACALLE",45,{"v":2,"d":"$ 2.00"},{"$f":"Tabla14253[[#This Row],[CANT.]]*Tabla14253[[#This Row],[PRECIO UNITARIO]]","v":{"v":90,"d":"$90.00"}},{"v":90,"d":"$ 90.00"},0,{"$f":"Tabla14253[[#This Row],[EFECTIVO]]+Tabla14253[[#This Row],[TRANSFERENCIA]]","v":{"v":90,"d":"$ 90.00"}},"CANCELADO",{"$f":"Tabla14253[[#This Row],[VALOR A PAGAR]]-Tabla14253[[#This Row],[VALOR CANCELADO]]","v":0},{"$f":"Tabla14253[[#This Row],[VALOR A PAGAR]]*0.5","v":{"v":45,"d":"$ 45.00"}},{"$f":"Tabla14253[[#This Row],[VALOR A PAGAR]]-Tabla14253[[#This Row],[COSTO]]","v":{"v":45,"d":"$ 45.00"}}]
["2024-12-19","DECIAP",3,{"v":2,"d":"$ 2.00"},{"$f":"Tabla14253[[#This Row],[CANT.]]*Tabla14253[[#This Row],[PRECIO UNITARIO]]","v":{"v":6,"d":"$6.00"}},0,{"v":6,"d":"$ 6.00"},{"$f":"Tabla14253[[#This Row],[EFECTIVO]]+Tabla14253[[#This Row],[TRANSFERENCIA]]","v":{"v":6,"d":"$ 6.00"}},"CANCELADO",{"$f":"Tabla14253[[#This Row],[VALOR A PAGAR]]-Tabla14253[[#This Row],[VALOR CANCELADO]]","v":0},{"$f":"Tabla14253[[#This Row],[VALOR A PAGAR]]*0.5","v":{"v":3,"d":"$ 3.00"}},{"$f":"Tabla14253[[#This Row],[VALOR A PAGAR]]-Tabla14253[[#This Row],[COSTO]]","v":{"v":3,"d":"$ 3.00"}}]
["2024-12-21","KO AMÉRICA",14,{"v":2,"d":"$ 2.00"},{"$f":"Tabla14253[[#This Row],[CANT.]]*Tabla14253[[#This Row],[PRECIO UNITARIO]]","v":{"v":28,"d":"$28.00"}},0,{"v":28,"d":"$ 28.00"},{"$f":"Tabla14253[[#This Row],[EFECTIVO]]+Tabla14253[[#This Row],[TRANSFERENCIA]]","v":{"v":28,"d":"$ 28.00"}},"CANCELADO",{"$f":"Tabla14253[[#This Row],[VALOR A PAGAR]]-Tabla14253[[#This Row],[VALOR CANCELADO]]","v":0},{"$f":"Tabla14253[[#This Row],[VALOR A PAGAR]]*0.5","v":{"v":14,"d":"$ 14.00"}},{"$f":"Tabla14253[[#This Row],[VALOR A PAGAR]]-Tabla14253[[#This Row],[COSTO]]","v":{"v":14,"d":"$ 14.00"}}]
["TOTAL",null,{"$f":"SUM(C4:C103)","v":1509},null,{"$f":"SUM(Tabla14253[VALOR A PAGAR])","v":{"v":3025,"d":"$3,025.00"}},{"$f":"SUM(F4:F103)","v":{"v":122,"d":"$122.00"}},{"$f":"SUM(G4:G103)","v":{"v":2922.5,"d":"$2,922.50"}},{"$f":"SUM(H4:H103)","v":{"v":3044.5,"d":"$3,044.50"}},null,null,{"$f":"SUM(K4:K103)","v":{"v":1512.5,"d":"$1,512.50"}},{"$f":"SUM(L4:L103)","v":{"v":1512.5,"d":"$1,512.50"}}]
[null,null,"DIPLOMAS ELABORADOS",null,"A RECAUDARSE","RECAUDADO EN EFECTIVO","RECAUDADO EN TRANSFERENCIA"]
[]
[]
[null,"RECAUDADO","MONTO"]
[null,"EFECTIVO",{"$f":"F104","v":{"v":122,"d":"$122.00"}}]
[null,"TRANSFERENCIA",{"$f":"G104","v":{"v":2922.5,"d":"$2,922.50"}}]
[null,"TOTAL",{"$f":"SUM(C109:C110)","v":{"v":3044.5,"d":"$3,044.50"}}]
[]
[]
[null,"POR COBRAR","MONTO"]
[null,{"$f":"B62","v":"TEAM TAURO"},{"v":20,"d":"$20.00"}]
[null,"TOTAL",{"$f":"SUM(C115:C115)","v":{"v":20,"d":"$20.00"}}]
[]
[]
[null,"DEVOLVER O HACER PASO","MONTO"]
[null,"MARCIAL CLUB GRANDA",{"v":2,"d":"$2.00"}]
[null,"ILYO M. P.",{"v":1.5,"d":"$1.50"}]
[null,"TAE DO ACADEMY",{"v":2,"d":"$2.00"}]
[null,"TOTAL KOMBAT ",{"v":34,"d":"$34.00"}]
[null,"TOTAL",{"$f":"SUM(C120:C123)","v":{"v":39.5,"d":"$39.50"}}]

{"sheet":"CERTIFICADOS DE ASCENSO 2025","index":6,"n_rows":64,"n_cols":15,"rows_kept":64,"merged":[[0,0,1,12],[46,0,46,1]]}
["DIPLOMAS DE ASCENSO (ENERO - 15 DE MARZO DE 2025)"]
[]
["FECHA","CLUB","CANT.","PRECIO UNITARIO","VALOR A PAGAR","EFECTIVO","TRANSFERENCIA","VALOR CANCELADO","ESTADO","SALDO","COSTO","GANANCIA","OBSERVACIONES",null,"TOTAL EFECTIVO"]
["2025-01-06","JITAE",1,{"v":2.5,"d":"$ 2.50"},{"$f":"Tabla1425[[#This Row],[CANT.]]*Tabla1425[[#This Row],[PRECIO UNITARIO]]","v":{"v":2.5,"d":"$2.50"}},{"v":2.5,"d":"$ 2.50"},0,{"$f":"Tabla1425[[#This Row],[EFECTIVO]]+Tabla1425[[#This Row],[TRANSFERENCIA]]","v":{"v":2.5,"d":"$ 2.50"}},{"$f":"IF((E4=H4),\"CANCELADO\",\"SALDO PENDIENTE\")","v":"CANCELADO"},{"$f":"Tabla1425[[#This Row],[VALOR A PAGAR]]-Tabla1425[[#This Row],[VALOR CANCELADO]]","v":0},{"$f":"Tabla1425[[#This Row],[VALOR A PAGAR]]*0.5","v":{"v":1.25,"d":"$ 1.25"}},{"$f":"Tabla1425[[#This Row],[VALOR A PAGAR]]-Tabla1425[[#This Row],[COSTO]]","v":{"v":1.25,"d":"$ 1.25"}}]
["2025-01-07","MARCIAL CLUB GRANDA",4,{"v":2.5,"d":"$ 2.50"},{"$f":"Tabla1425[[#This Row],[CANT.]]*Tabla1425[[#This Row],[PRECIO UNITARIO]]","v":{"v":10,"d":"$10.00"}},0,{"v":10,"d":"$ 10.00"},{"$f":"Tabla1425[[#This Row],[EFECTIVO]]+Tabla1425[[#This Row],[TRANSFERENCIA]]","v":{"v":10,"d":"$ 10.00"}},"CANCELADO",{"$f":"Tabla1425[[#This Row],[VALOR A PAGAR]]-Tabla1425[[#This Row],[VALOR CANCELADO]]","v":0},{"$f":"Tabla1425[[#This Row],[VALOR A PAGAR]]*0.5","v":{"v":5,"d":"$ 5.00"}},{"$f":"Tabla1425[[#This Row],[VALOR A PAGAR]]-Tabla1425[[#This Row],[COSTO]]","v":{"v":5,"d":"$ 5.00"}},"USO DE SALDO A FAVOR EL 20-01-2025SALDO A FAVOR DEL CLUB $5"]
["2025-01-08","CHUNG SONG",8,{"v":2.5,"d":"$ 2.50"},{"$f":"Tabla1425[[#This Row],[CANT.]]*Tabla1425[[#This Row],[PRECIO UNITARIO]]","v":{"v":20,"d":"$20.00"}},0,{"v":20,"d":"$ 20.00"},{"$f":"Tabla1425[[#This Row],[EFECTIVO]]+Tabla1425[[#This Row],[TRANSFERENCIA]]","v":{"v":20,"d":"$ 20.00"}},"CANCELADO",{"$f":"Tabla1425[[#This Row],[VALOR A PAGAR]]-Tabla1425[[#This Row],[VALOR CANCELADO]]","v":0},{"$f":"Tabla1425[[#This Row],[VALOR A PAGAR]]*0.5","v":{"v":10,"d":"$ 10.00"}},{"$f":"Tabla1425[[#This Row],[VALOR A PAGAR]]-Tabla1425[[#This Row],[COSTO]]","v":{"v":10,"d":"$ 10.00"}}]
["2025-01-08","SCORPIUS",1,{"v":2.5,"d":"$ 2.50"},{"$f":"Tabla1425[[#This Row],[CANT.]]*Tabla1425[[#This Row],[PRECIO UNITARIO]]","v":{"v":2.5,"d":"$2.50"}},0,{"v":2.5,"d":"$ 2.50"},{"$f":"Tabla1425[[#This Row],[EFECTIVO]]+Tabla1425[[#This Row],[TRANSFERENCIA]]","v":{"v":2.5,"d":"$ 2.50"}},"CANCELADO",{"$f":"Tabla1425[[#This Row],[VALOR A PAGAR]]-Tabla1425[[#This Row],[VALOR CANCELADO]]","v":0},{"$f":"Tabla1425[[#This Row],[VALOR A PAGAR]]*0.5","v":{"v":1.25,"d":"$ 1.25"}},{"$f":"Tabla1425[[#This Row],[VALOR A PAGAR]]-Tabla1425[[#This Row],[COSTO]]","v":{"v":1.25,"d":"$ 1.25"}}]
["2025-01-10","MOODUKKWAN TRAINING CENTER",27,{"v":2.5,"d":"$ 2.50"},{"$f":"Tabla1425[[#This Row],[CANT.]]*Tabla1425[[#This Row],[PRECIO UNITARIO]]","v":{"v":67.5,"d":"$67.50"}},0,{"v":67.5,"d":"$ 67.50"},{"$f":"Tabla1425[[#This Row],[EFECTIVO]]+Tabla1425[[#This Row],[TRANSFERENCIA]]","v":{"v":67.5,"d":"$ 67.50"}},"CANCELADO",{"$f":"Tabla1425[[#This Row],[VALOR A PAGAR]]-Tabla1425[[#This Row],[VALOR CANCELADO]]","v":0},{"$f":"Tabla1425[[#This Row],[VALOR A PAGAR]]*0.5","v":{"v":33.75,"d":"$ 33.75"}},{"$f":"Tabla1425[[#This Row],[VALOR A PAGAR]]-Tabla1425[[#This Row],[COSTO]]","v":{"v":33.75,"d":"$ 33.75"}},"HACE USO DE SALDO A FAVOR "]
["2025-01-15","MIT-TKD",14,{"v":2.5,"d":"$ 2.50"},{"$f":"Tabla1425[[#This Row],[CANT.]]*Tabla1425[[#This Row],[PRECIO UNITARIO]]","v":{"v":35,"d":"$35.00"}},0,{"v":35,"d":"$ 35.00"},{"$f":"Tabla1425[[#This Row],[EFECTIVO]]+Tabla1425[[#This Row],[TRANSFERENCIA]]","v":{"v":35,"d":"$ 35.00"}},"CANCELADO",{"$f":"Tabla1425[[#This Row],[VALOR A PAGAR]]-Tabla1425[[#This Row],[VALOR CANCELADO]]","v":0},{"$f":"Tabla1425[[#This Row],[VALOR A PAGAR]]*0.5","v":{"v":17.5,"d":"$ 17.50"}},{"$f":"Tabla1425[[#This Row],[VALOR A PAGAR]]-Tabla1425[[#This Row],[COSTO]]","v":{"v":17.5,"d":"$ 17.50"}}]
["2025-01-20","MARCIAL CLUB GRANDA",2,{"v":2.5,"d":"$ 2.50"},{"$f":"Tabla1425[[#This Row],[CANT.]]*Tabla1425[[#This Row],[PRECIO UNITARIO]]","v":{"v":5,"d":"$5.00"}},0,{"v":5,"d":"$ 5.00"},{"$f":"Tabla1425[[#This Row],[EFECTIVO]]+Tabla1425[[#This Row],[TRANSFERENCIA]]","v":{"v":5,"d":"$ 5.00"}},"CANCELADO",{"$f":"Tabla1425[[#This Row],[VALOR A PAGAR]]-Tabla1425[[#This Row],[VALOR CANCELADO]]","v":0},{"$f":"Tabla1425[[#This Row],[VALOR A PAGAR]]*0.5","v":{"v":2.5,"d":"$ 2.50"}},{"$f":"Tabla1425[[#This Row],[VALOR A PAGAR]]-Tabla1425[[#This Row],[COSTO]]","v":{"v":2.5,"d":"$ 2.50"}},"HACE USO DE SALDO A FAVOR 07-01-2025"]
["2025-01-20","ASOTKD - P CHIMBACALLE",2,{"v":2.5,"d":"$ 2.50"},{"$f":"Tabla1425[[#This Row],[CANT.]]*Tabla1425[[#This Row],[PRECIO UNITARIO]]","v":{"v":5,"d":"$5.00"}},0,{"v":5,"d":"$ 5.00"},{"$f":"Tabla1425[[#This Row],[EFECTIVO]]+Tabla1425[[#This Row],[TRANSFERENCIA]]","v":{"v":5,"d":"$ 5.00"}},"CANCELADO",{"$f":"Tabla1425[[#This Row],[VALOR A PAGAR]]-Tabla1425[[#This Row],[VALOR CANCELADO]]","v":0},{"$f":"Tabla1425[[#This Row],[VALOR A PAGAR]]*0.5","v":{"v":2.5,"d":"$ 2.50"}},{"$f":"Tabla1425[[#This Row],[VALOR A PAGAR]]-Tabla1425[[#This Row],[COSTO]]","v":{"v":2.5,"d":"$ 2.50"}}]
["2025-01-20","MSA GRAND MASTER",26,{"v":2.5,"d":"$ 2.50"},{"$f":"Tabla1425[[#This Row],[CANT.]]*Tabla1425[[#This Row],[PRECIO UNITARIO]]","v":{"v":65,"d":"$65.00"}},0,{"v":65,"d":"$ 65.00"},{"$f":"Tabla1425[[#This Row],[EFECTIVO]]+Tabla1425[[#This Row],[TRANSFERENCIA]]","v":{"v":65,"d":"$ 65.00"}},"CANCELADO",{"$f":"Tabla1425[[#This Row],[VALOR A PAGAR]]-Tabla1425[[#This Row],[VALOR CANCELADO]]","v":0},{"$f":"Tabla1425[[#This Row],[VALOR A PAGAR]]*0.5","v":{"v":32.5,"d":"$ 32.50"}},{"$f":"Tabla1425[[#This Row],[VALOR A PAGAR]]-Tabla1425[[#This Row],[COSTO]]","v":{"v":32.5,"d":"$ 32.50"}}]
["2025-01-21","KO AMÉRICA",15,{"v":2.5,"d":"$ 2.50"},{"$f":"Tabla1425[[#This Row],[CANT.]]*Tabla1425[[#This Row],[PRECIO UNITARIO]]","v":{"v":37.5,"d":"$37.50"}},0,{"v":37.5,"d":"$ 37.50"},{"$f":"Tabla1425[[#This Row],[EFECTIVO]]+Tabla1425[[#This Row],[TRANSFERENCIA]]","v":{"v":37.5,"d":"$ 37.50"}},"CANCELADO",{"$f":"Tabla1425[[#This Row],[VALOR A PAGAR]]-Tabla1425[[#This Row],[VALOR CANCELADO]]","v":0},{"$f":"Tabla1425[[#This Row],[VALOR A PAGAR]]*0.5","v":{"v":18.75,"d":"$ 18.75"}},{"$f":"Tabla1425[[#This Row],[VALOR A PAGAR]]-Tabla1425[[#This Row],[COSTO]]","v":{"v":18.75,"d":"$ 18.75"}}]
["2025-01-25","PVM - ROJAS IAN IRON FIST",33,{"v":2.5,"d":"$ 2.50"},{"$f":"Tabla1425[[#This Row],[CANT.]]*Tabla1425[[#This Row],[PRECIO UNITARIO]]","v":{"v":82.5,"d":"$82.50"}},0,{"v":82.5,"d":"$ 82.50"},{"$f":"Tabla1425[[#This Row],[EFECTIVO]]+Tabla1425[[#This Row],[TRANSFERENCIA]]","v":{"v":82.5,"d":"$ 82.50"}},"CANCELADO",{"$f":"Tabla1425[[#This Row],[VALOR A PAGAR]]-Tabla1425[[#This Row],[VALOR CANCELADO]]","v":0},{"$f":"Tabla1425[[#This Row],[VALOR A PAGAR]]*0.5","v":{"v":41.25,"d":"$ 41.25"}},{"$f":"Tabla1425[[#This Row],[VALOR A PAGAR]]-Tabla1425[[#This Row],[COSTO]]","v":{"v":41.25,"d":"$ 41.25"}}]
["2025-01-25","DRACO",44,{"v":2,"d":"$ 2.00"},{"$f":"Tabla1425[[#This Row],[CANT.]]*Tabla1425[[#This Row],[PRECIO UNITARIO]]","v":{"v":88,"d":"$88.00"}},0,{"v":88,"d":"$ 88.00"},{"$f":"Tabla1425[[#This Row],[EFECTIVO]]+Tabla1425[[#This Row],[TRANSFERENCIA]]","v":{"v":88,"d":"$ 88.00"}},"CANCELADO",{"$f":"Tabla1425[[#This Row],[VALOR A PAGAR]]-Tabla1425[[#This Row],[VALOR CANCELADO]]","v":0},{"$f":"Tabla1425[[#This Row],[VALOR A PAGAR]]*0.5","v":{"v":44,"d":"$ 44.00"}},{"$f":"Tabla1425[[#This Row],[VALOR A PAGAR]]-Tabla1425[[#This Row],[COSTO]]","v":{"v":44,"d":"$ 44.00"}},"PAGA EL 26-12-2024 Y ENVÍA DATOS 25-01-2025"]
["2025-01-27","TAE SHO KU",11,{"v":2.5,"d":"$ 2.50"},{"$f":"Tabla1425[[#This Row],[CANT.]]*Tabla1425[[#This Row],[PRECIO UNITARIO]]","v":{"v":27.5,"d":"$27.50"}},0,{"v":27.5,"d":"$ 27.50"},{"$f":"Tabla1425[[#This Row],[EFECTIVO]]+Tabla1425[[#This Row],[TRANSFERENCIA]]","v":{"v":27.5,"d":"$ 27.50"}},"CANCELADO",{"$f":"Tabla1425[[#This Row],[VALOR A PAGAR]]-Tabla1425[[#This Row],[VALOR CANCELADO]]","v":0},{"$f":"Tabla1425[[#This Row],[VALOR A PAGAR]]*0.5","v":{"v":13.75,"d":"$ 13.75"}},{"$f":"Tabla1425[[#This Row],[VALOR A PAGAR]]-Tabla1425[[#This Row],[COSTO]]","v":{"v":13.75,"d":"$ 13.75"}},"PAGO EN DOS DEPÓSITOS"]
["2025-01-28","BAEKJUL TEAM AYALAZ",23,{"v":2.5,"d":"$ 2.50"},{"$f":"Tabla1425[[#This Row],[CANT.]]*Tabla1425[[#This Row],[PRECIO UNITARIO]]","v":{"v":57.5,"d":"$57.50"}},0,{"v":57.5,"d":"$ 57.50"},{"$f":"Tabla1425[[#This Row],[EFECTIVO]]+Tabla1425[[#This Row],[TRANSFERENCIA]]","v":{"v":57.5,"d":"$ 57.50"}},"CANCELADO",{"$f":"Tabla1425[[#This Row],[VALOR A PAGAR]]-Tabla1425[[#This Row],[VALOR CANCELADO]]","v":0},{"$f":"Tabla1425[[#This Row],[VALOR A PAGAR]]*0.5","v":{"v":28.75,"d":"$ 28.75"}},{"$f":"Tabla1425[[#This Row],[VALOR A PAGAR]]-Tabla1425[[#This Row],[COSTO]]","v":{"v":28.75,"d":"$ 28.75"}}]
["2025-01-29","ECUADOR",38,{"v":2.5,"d":"$ 2.50"},{"$f":"Tabla1425[[#This Row],[CANT.]]*Tabla1425[[#This Row],[PRECIO UNITARIO]]","v":{"v":95,"d":"$95.00"}},0,{"v":95,"d":"$ 95.00"},{"$f":"Tabla1425[[#This Row],[EFECTIVO]]+Tabla1425[[#This Row],[TRANSFERENCIA]]","v":{"v":95,"d":"$ 95.00"}},"CANCELADO",{"$f":"Tabla1425[[#This Row],[VALOR A PAGAR]]-Tabla1425[[#This Row],[VALOR CANCELADO]]","v":0},{"$f":"Tabla1425[[#This Row],[VALOR A PAGAR]]*0.5","v":{"v":47.5,"d":"$ 47.50"}},{"$f":"Tabla1425[[#This Row],[VALOR A PAGAR]]-Tabla1425[[#This Row],[COSTO]]","v":{"v":47.5,"d":"$ 47.50"}}]
["2025-01-29","FARANG",4,{"v":2.5,"d":"$ 2.50"},{"$f":"Tabla1425[[#This Row],[CANT.]]*Tabla1425[[#This Row],[PRECIO UNITARIO]]","v":{"v":10,"d":"$10.00"}},0,{"v":10,"d":"$ 10.00"},{"$f":"Tabla1425[[#This Row],[EFECTIVO]]+Tabla1425[[#This Row],[TRANSFERENCIA]]","v":{"v":10,"d":"$ 10.00"}},"CANCELADO",{"$f":"Tabla1425[[#This Row],[VALOR A PAGAR]]-Tabla1425[[#This Row],[VALOR CANCELADO]]","v":0},{"$f":"Tabla1425[[#This Row],[VALOR A PAGAR]]*0.5","v":{"v":5,"d":"$ 5.00"}},{"$f":"Tabla1425[[#This Row],[VALOR A PAGAR]]-Tabla1425[[#This Row],[COSTO]]","v":{"v":5,"d":"$ 5.00"}}]
["2025-01-30","UNIVERSIDAD DE LOS HEMISFERIOS",1,{"v":2.5,"d":"$ 2.50"},{"$f":"Tabla1425[[#This Row],[CANT.]]*Tabla1425[[#This Row],[PRECIO UNITARIO]]","v":{"v":2.5,"d":"$2.50"}},{"v":2.5,"d":"$ 2.50"},0,{"$f":"Tabla1425[[#This Row],[EFECTIVO]]+Tabla1425[[#This Row],[TRANSFERENCIA]]","v":{"v":2.5,"d":"$ 2.50"}},"CANCELADO",{"$f":"Tabla1425[[#This Row],[VALOR A PAGAR]]-Tabla1425[[#This Row],[VALOR CANCELADO]]","v":0},{"$f":"Tabla1425[[#This Row],[VALOR A PAGAR]]*0.5","v":{"v":1.25,"d":"$ 1.25"}},{"$f":"Tabla1425[[#This Row],[VALOR A PAGAR]]-Tabla1425[[#This Row],[COSTO]]","v":{"v":1.25,"d":"$ 1.25"}}]
["2025-01-31","PVM - ROJAS IAN IRON FIST",2,{"v":2.5,"d":"$ 2.50"},{"$f":"Tabla1425[[#This Row],[CANT.]]*Tabla1425[[#This Row],[PRECIO UNITARIO]]","v":{"v":5,"d":"$5.00"}},{"v":5,"d":"$ 5.00"},0,{"$f":"Tabla1425[[#This Row],[EFECTIVO]]+Tabla1425[[#This Row],[TRANSFERENCIA]]","v":{"v":5,"d":"$ 5.00"}},"CANCELADO",{"$f":"Tabla1425[[#This Row],[VALOR A PAGAR]]-Tabla1425[[#This Row],[VALOR CANCELADO]]","v":0},{"$f":"Tabla1425[[#This Row],[VALOR A PAGAR]]*0.5","v":{"v":2.5,"d":"$ 2.50"}},{"$f":"Tabla1425[[#This Row],[VALOR A PAGAR]]-Tabla1425[[#This Row],[COSTO]]","v":{"v":2.5,"d":"$ 2.50"}}]
["2025-01-31","TEAM VENCEDORES",1,{"v":2.5,"d":"$ 2.50"},{"$f":"Tabla1425[[#This Row],[CANT.]]*Tabla1425[[#This Row],[PRECIO UNITARIO]]","v":{"v":2.5,"d":"$2.50"}},0,{"v":2.5,"d":"$ 2.50"},{"$f":"Tabla1425[[#This Row],[EFECTIVO]]+Tabla1425[[#This Row],[TRANSFERENCIA]]","v":{"v":2.5,"d":"$ 2.50"}},"CANCELADO",{"$f":"Tabla1425[[#This Row],[VALOR A PAGAR]]-Tabla1425[[#This Row],[VALOR CANCELADO]]","v":0},{"$f":"Tabla1425[[#This Row],[VALOR A PAGAR]]*0.5","v":{"v":1.25,"d":"$ 1.25"}},{"$f":"Tabla1425[[#This Row],[VALOR A PAGAR]]-Tabla1425[[#This Row],[COSTO]]","v":{"v":1.25,"d":"$ 1.25"}}]
["2025-02-04","DRAGON LEE GYM",1,{"v":2.5,"d":"$ 2.50"},{"$f":"Tabla1425[[#This Row],[CANT.]]*Tabla1425[[#This Row],[PRECIO UNITARIO]]","v":{"v":2.5,"d":"$2.50"}},{"v":0.5,"d":"$ 0.50"},{"v":2,"d":"$ 2.00"},{"$f":"Tabla1425[[#This Row],[EFECTIVO]]+Tabla1425[[#This Row],[TRANSFERENCIA]]","v":{"v":2.5,"d":"$ 2.50"}},"CANCELADO",{"$f":"Tabla1425[[#This Row],[VALOR A PAGAR]]-Tabla1425[[#This Row],[VALOR CANCELADO]]","v":0},{"$f":"Tabla1425[[#This Row],[VALOR A PAGAR]]*0.5","v":{"v":1.25,"d":"$ 1.25"}},{"$f":"Tabla1425[[#This Row],[VALOR A PAGAR]]-Tabla1425[[#This Row],[COSTO]]","v":{"v":1.25,"d":"$ 1.25"}}]
["2025-02-05","BAS PANTHERS",27,{"v":2.5,"d":"$ 2.50"},{"$f":"Tabla1425[[#This Row],[CANT.]]*Tabla1425[[#This Row],[PRECIO UNITARIO]]","v":{"v":67.5,"d":"$67.50"}},0,{"v":67.5,"d":"$ 67.50"},{"$f":"Tabla1425[[#This Row],[EFECTIVO]]+Tabla1425[[#This Row],[TRANSFERENCIA]]","v":{"v":67.5,"d":"$ 67.50"}},"CANCELADO",{"$f":"Tabla1425[[#This Row],[VALOR A PAGAR]]-Tabla1425[[#This Row],[VALOR CANCELADO]]","v":0},{"$f":"Tabla1425[[#This Row],[VALOR A PAGAR]]*0.5","v":{"v":33.75,"d":"$ 33.75"}},{"$f":"Tabla1425[[#This Row],[VALOR A PAGAR]]-Tabla1425[[#This Row],[COSTO]]","v":{"v":33.75,"d":"$ 33.75"}},"PASO CON JARROS NAVIDEÑOS SELECCIONADOS PROVINCIALES"]
["2025-02-05","CHUNG SONG",8,{"v":2.5,"d":"$ 2.50"},{"$f":"Tabla1425[[#This Row],[CANT.]]*Tabla1425[[#This Row],[PRECIO UNITARIO]]","v":{"v":20,"d":"$20.00"}},0,{"v":20,"d":"$ 20.00"},{"$f":"Tabla1425[[#This Row],[EFECTIVO]]+Tabla1425[[#This Row],[TRANSFERENCIA]]","v":{"v":20,"d":"$ 20.00"}},"CANCELADO",{"$f":"Tabla1425[[#This Row],[VALOR A PAGAR]]-Tabla1425[[#This Row],[VALOR CANCELADO]]","v":0},{"$f":"Tabla1425[[#This Row],[VALOR A PAGAR]]*0.5","v":{"v":10,"d":"$ 10.00"}},{"$f":"Tabla1425[[#This Row],[VALOR A PAGAR]]-Tabla1425[[#This Row],[COSTO]]","v":{"v":10,"d":"$ 10.00"}}]
["2025-02-05","PIONERO FORTIS",22,{"v":2.5,"d":"$ 2.50"},{"$f":"Tabla1425[[#This Row],[CANT.]]*Tabla1425[[#This Row],[PRECIO UNITARIO]]","v":{"v":55,"d":"$55.00"}},0,{"v":55,"d":"$ 55.00"},{"$f":"Tabla1425[[#This Row],[EFECTIVO]]+Tabla1425[[#This Row],[TRANSFERENCIA]]","v":{"v":55,"d":"$ 55.00"}},"CANCELADO",{"$f":"Tabla1425[[#This Row],[VALOR A PAGAR]]-Tabla1425[[#This Row],[VALOR CANCELADO]]","v":0},{"$f":"Tabla1425[[#This Row],[VALOR A PAGAR]]*0.5","v":{"v":27.5,"d":"$ 27.50"}},{"$f":"Tabla1425[[#This Row],[VALOR A PAGAR]]-Tabla1425[[#This Row],[COSTO]]","v":{"v":27.5,"d":"$ 27.50"}}]
["2025-02-10","L. D. C. MEJÍA",20,{"v":2.5,"d":"$ 2.50"},{"$f":"Tabla1425[[#This Row],[CANT.]]*Tabla1425[[#This Row],[PRECIO UNITARIO]]","v":{"v":50,"d":"$50.00"}},0,{"v":50,"d":"$ 50.00"},{"$f":"Tabla1425[[#This Row],[EFECTIVO]]+Tabla1425[[#This Row],[TRANSFERENCIA]]","v":{"v":50,"d":"$ 50.00"}},"CANCELADO",{"$f":"Tabla1425[[#This Row],[VALOR A PAGAR]]-Tabla1425[[#This Row],[VALOR CANCELADO]]","v":0},{"$f":"Tabla1425[[#This Row],[VALOR A PAGAR]]*0.5","v":{"v":25,"d":"$ 25.00"}},{"$f":"Tabla1425[[#This Row],[VALOR A PAGAR]]-Tabla1425[[#This Row],[COSTO]]","v":{"v":25,"d":"$ 25.00"}}]
["2025-02-10","HAN KUM DO",11,{"v":2.5,"d":"$ 2.50"},{"$f":"Tabla1425[[#This Row],[CANT.]]*Tabla1425[[#This Row],[PRECIO UNITARIO]]","v":{"v":27.5,"d":"$27.50"}},0,{"v":27.5,"d":"$ 27.50"},{"$f":"Tabla1425[[#This Row],[EFECTIVO]]+Tabla1425[[#This Row],[TRANSFERENCIA]]","v":{"v":27.5,"d":"$ 27.50"}},"CANCELADO",{"$f":"Tabla1425[[#This Row],[VALOR A PAGAR]]-Tabla1425[[#This Row],[VALOR CANCELADO]]","v":0},{"$f":"Tabla1425[[#This Row],[VALOR A PAGAR]]*0.5","v":{"v":13.75,"d":"$ 13.75"}},{"$f":"Tabla1425[[#This Row],[VALOR A PAGAR]]-Tabla1425[[#This Row],[COSTO]]","v":{"v":13.75,"d":"$ 13.75"}}]
["2025-02-10","DOJANG TKD MELO",15,{"v":2.5,"d":"$ 2.50"},{"$f":"Tabla1425[[#This Row],[CANT.]]*Tabla1425[[#This Row],[PRECIO UNITARIO]]","v":{"v":37.5,"d":"$37.50"}},0,{"v":37.5,"d":"$ 37.50"},{"$f":"Tabla1425[[#This Row],[EFECTIVO]]+Tabla1425[[#This Row],[TRANSFERENCIA]]","v":{"v":37.5,"d":"$ 37.50"}},"CANCELADO",{"$f":"Tabla1425[[#This Row],[VALOR A PAGAR]]-Tabla1425[[#This Row],[VALOR CANCELADO]]","v":0},{"$f":"Tabla1425[[#This Row],[VALOR A PAGAR]]*0.5","v":{"v":18.75,"d":"$ 18.75"}},{"$f":"Tabla1425[[#This Row],[VALOR A PAGAR]]-Tabla1425[[#This Row],[COSTO]]","v":{"v":18.75,"d":"$ 18.75"}}]
["2025-02-13","FURIA NEGRA",7,{"v":2.5,"d":"$ 2.50"},{"$f":"Tabla1425[[#This Row],[CANT.]]*Tabla1425[[#This Row],[PRECIO UNITARIO]]","v":{"v":17.5,"d":"$17.50"}},0,{"v":17.5,"d":"$ 17.50"},{"$f":"Tabla1425[[#This Row],[EFECTIVO]]+Tabla1425[[#This Row],[TRANSFERENCIA]]","v":{"v":17.5,"d":"$ 17.50"}},"CANCELADO",{"$f":"Tabla1425[[#This Row],[VALOR A PAGAR]]-Tabla1425[[#This Row],[VALOR CANCELADO]]","v":0},{"$f":"Tabla1425[[#This Row],[VALOR A PAGAR]]*0.5","v":{"v":8.75,"d":"$ 8.75"}},{"$f":"Tabla1425[[#This Row],[VALOR A PAGAR]]-Tabla1425[[#This Row],[COSTO]]","v":{"v":8.75,"d":"$ 8.75"}}]
["2025-02-13","KYORUGUI GYM",20,{"v":2.5,"d":"$ 2.50"},{"$f":"Tabla1425[[#This Row],[CANT.]]*Tabla1425[[#This Row],[PRECIO UNITARIO]]","v":{"v":50,"d":"$50.00"}},0,{"v":50,"d":"$ 50.00"},{"$f":"Tabla1425[[#This Row],[EFECTIVO]]+Tabla1425[[#This Row],[TRANSFERENCIA]]","v":{"v":50,"d":"$ 50.00"}},"CANCELADO",{"$f":"Tabla1425[[#This Row],[VALOR A PAGAR]]-Tabla1425[[#This Row],[VALOR CANCELADO]]","v":0},{"$f":"Tabla1425[[#This Row],[VALOR A PAGAR]]*0.5","v":{"v":25,"d":"$ 25.00"}},{"$f":"Tabla1425[[#This Row],[VALOR A PAGAR]]-Tabla1425[[#This Row],[COSTO]]","v":{"v":25,"d":"$ 25.00"}}]
["2025-02-17","KYORUGUI GYM",1,{"v":2.5,"d":"$ 2.50"},{"$f":"Tabla1425[[#This Row],[CANT.]]*Tabla1425[[#This Row],[PRECIO UNITARIO]]","v":{"v":2.5,"d":"$2.50"}},0,{"v":2.5,"d":"$ 2.50"},{"$f":"Tabla1425[[#This Row],[EFECTIVO]]+Tabla1425[[#This Row],[TRANSFERENCIA]]","v":{"v":2.5,"d":"$ 2.50"}},"CANCELADO",{"$f":"Tabla1425[[#This Row],[VALOR A PAGAR]]-Tabla1425[[#This Row],[VALOR CANCELADO]]","v":0},{"$f":"Tabla1425[[#This Row],[VALOR A PAGAR]]*0.5","v":{"v":1.25,"d":"$ 1.25"}},{"$f":"Tabla1425[[#This Row],[VALOR A PAGAR]]-Tabla1425[[#This Row],[COSTO]]","v":{"v":1.25,"d":"$ 1.25"}}]
["2025-02-18","RYONG TAE",1,{"v":2.5,"d":"$ 2.50"},{"$f":"Tabla1425[[#This Row],[CANT.]]*Tabla1425[[#This Row],[PRECIO UNITARIO]]","v":{"v":2.5,"d":"$2.50"}},0,{"v":2.5,"d":"$ 2.50"},{"$f":"Tabla1425[[#This Row],[EFECTIVO]]+Tabla1425[[#This Row],[TRANSFERENCIA]]","v":{"v":2.5,"d":"$ 2.50"}},"CANCELADO",{"$f":"Tabla1425[[#This Row],[VALOR A PAGAR]]-Tabla1425[[#This Row],[VALOR CANCELADO]]","v":0},{"$f":"Tabla1425[[#This Row],[VALOR A PAGAR]]*0.5","v":{"v":1.25,"d":"$ 1.25"}},{"$f":"Tabla1425[[#This Row],[VALOR A PAGAR]]-Tabla1425[[#This Row],[COSTO]]","v":{"v":1.25,"d":"$ 1.25"}},"PASO CON SALDO A FAVOR (USA $2,50 PARA CERTIFICADO DE ASCENSO QUEDA A FAVOR 1,50)"]
["2025-02-18","PIONERO",1,{"v":2.5,"d":"$ 2.50"},{"$f":"Tabla1425[[#This Row],[CANT.]]*Tabla1425[[#This Row],[PRECIO UNITARIO]]","v":{"v":2.5,"d":"$2.50"}},0,{"v":2.5,"d":"$ 2.50"},{"$f":"Tabla1425[[#This Row],[EFECTIVO]]+Tabla1425[[#This Row],[TRANSFERENCIA]]","v":{"v":2.5,"d":"$ 2.50"}},"CANCELADO",{"$f":"Tabla1425[[#This Row],[VALOR A PAGAR]]-Tabla1425[[#This Row],[VALOR CANCELADO]]","v":0},{"$f":"Tabla1425[[#This Row],[VALOR A PAGAR]]*0.5","v":{"v":1.25,"d":"$ 1.25"}},{"$f":"Tabla1425[[#This Row],[VALOR A PAGAR]]-Tabla1425[[#This Row],[COSTO]]","v":{"v":1.25,"d":"$ 1.25"}}]
["2025-02-18","HIMCHARI",47,{"v":2.5,"d":"$ 2.50"},{"$f":"Tabla1425[[#This Row],[CANT.]]*Tabla1425[[#This Row],[PRECIO UNITARIO]]","v":{"v":117.5,"d":"$117.50"}},0,{"v":117.5,"d":"$ 117.50"},{"$f":"Tabla1425[[#This Row],[EFECTIVO]]+Tabla1425[[#This Row],[TRANSFERENCIA]]","v":{"v":117.5,"d":"$ 117.50"}},"CANCELADO",{"$f":"Tabla1425[[#This Row],[VALOR A PAGAR]]-Tabla1425[[#This Row],[VALOR CANCELADO]]","v":0},{"$f":"Tabla1425[[#This Row],[VALOR A PAGAR]]*0.5","v":{"v":58.75,"d":"$ 58.75"}},{"$f":"Tabla1425[[#This Row],[VALOR A PAGAR]]-Tabla1425[[#This Row],[COSTO]]","v":{"v":58.75,"d":"$ 58.75"}}]
["2025-02-21","MICHAY DO",1,{"v":2.5,"d":"$ 2.50"},{"$f":"Tabla1425[[#This Row],[CANT.]]*Tabla1425[[#This Row],[PRECIO UNITARIO]]","v":{"v":2.5,"d":"$2.50"}},0,{"v":2.5,"d":"$ 2.50"},{"$f":"Tabla1425[[#This Row],[EFECTIVO]]+Tabla1425[[#This Row],[TRANSFERENCIA]]","v":{"v":2.5,"d":"$ 2.50"}},"CANCELADO",{"$f":"Tabla1425[[#This Row],[VALOR A PAGAR]]-Tabla1425[[#This Row],[VALOR CANCELADO]]","v":0},{"$f":"Tabla1425[[#This Row],[VALOR A PAGAR]]*0.5","v":{"v":1.25,"d":"$ 1.25"}},{"$f":"Tabla1425[[#This Row],[VALOR A PAGAR]]-Tabla1425[[#This Row],[COSTO]]","v":{"v":1.25,"d":"$ 1.25"}}]
["2025-02-24","KYORUGUI GYM",3,{"v":2.5,"d":"$ 2.50"},{"$f":"Tabla1425[[#This Row],[CANT.]]*Tabla1425[[#This Row],[PRECIO UNITARIO]]","v":{"v":7.5,"d":"$7.50"}},0,{"v":7.5,"d":"$ 7.50"},{"$f":"Tabla1425[[#This Row],[EFECTIVO]]+Tabla1425[[#This Row],[TRANSFERENCIA]]","v":{"v":7.5,"d":"$ 7.50"}},"CANCELADO",{"$f":"Tabla1425[[#This Row],[VALOR A PAGAR]]-Tabla1425[[#This Row],[VALOR CANCELADO]]","v":0},{"$f":"Tabla1425[[#This Row],[VALOR A PAGAR]]*0.5","v":{"v":3.75,"d":"$ 3.75"}},{"$f":"Tabla1425[[#This Row],[VALOR A PAGAR]]-Tabla1425[[#This Row],[COSTO]]","v":{"v":3.75,"d":"$ 3.75"}}]
["2025-02-24","BORJA'S LIONS",26,{"v":2.5,"d":"$ 2.50"},{"$f":"Tabla1425[[#This Row],[CANT.]]*Tabla1425[[#This Row],[PRECIO UNITARIO]]","v":{"v":65,"d":"$65.00"}},0,{"v":65,"d":"$ 65.00"},{"$f":"Tabla1425[[#This Row],[EFECTIVO]]+Tabla1425[[#This Row],[TRANSFERENCIA]]","v":{"v":65,"d":"$ 65.00"}},"CANCELADO",{"$f":"Tabla1425[[#This Row],[VALOR A PAGAR]]-Tabla1425[[#This Row],[VALOR CANCELADO]]","v":0},{"$f":"Tabla1425[[#This Row],[VALOR A PAGAR]]*0.5","v":{"v":32.5,"d":"$ 32.50"}},{"$f":"Tabla1425[[#This Row],[VALOR A PAGAR]]-Tabla1425[[#This Row],[COSTO]]","v":{"v":32.5,"d":"$ 32.50"}}]
["2025-02-24","SAN SEBASTIÁN",2,{"v":2.5,"d":"$ 2.50"},{"$f":"Tabla1425[[#This Row],[CANT.]]*Tabla1425[[#This Row],[PRECIO UNITARIO]]","v":{"v":5,"d":"$5.00"}},0,{"v":5,"d":"$ 5.00"},{"$f":"Tabla1425[[#This Row],[EFECTIVO]]+Tabla1425[[#This Row],[TRANSFERENCIA]]","v":{"v":5,"d":"$ 5.00"}},"CANCELADO",{"$f":"Tabla1425[[#This Row],[VALOR A PAGAR]]-Tabla1425[[#This Row],[VALOR CANCELADO]]","v":0},{"$f":"Tabla1425[[#This Row],[VALOR A PAGAR]]*0.5","v":{"v":2.5,"d":"$ 2.50"}},{"$f":"Tabla1425[[#This Row],[VALOR A PAGAR]]-Tabla1425[[#This Row],[COSTO]]","v":{"v":2.5,"d":"$ 2.50"}}]
["2025-02-25","JIDOKWAN",1,{"v":2.5,"d":"$ 2.50"},{"$f":"Tabla1425[[#This Row],[CANT.]]*Tabla1425[[#This Row],[PRECIO UNITARIO]]","v":{"v":2.5,"d":"$2.50"}},0,{"v":2.5,"d":"$ 2.50"},{"$f":"Tabla1425[[#This Row],[EFECTIVO]]+Tabla1425[[#This Row],[TRANSFERENCIA]]","v":{"v":2.5,"d":"$ 2.50"}},"CANCELADO",{"$f":"Tabla1425[[#This Row],[VALOR A PAGAR]]-Tabla1425[[#This Row],[VALOR CANCELADO]]","v":0},{"$f":"Tabla1425[[#This Row],[VALOR A PAGAR]]*0.5","v":{"v":1.25,"d":"$ 1.25"}},{"$f":"Tabla1425[[#This Row],[VALOR A PAGAR]]-Tabla1425[[#This Row],[COSTO]]","v":{"v":1.25,"d":"$ 1.25"}}]
["2025-02-26","ASOTKD - VICENTINA",19,{"v":2.5,"d":"$ 2.50"},{"$f":"Tabla1425[[#This Row],[CANT.]]*Tabla1425[[#This Row],[PRECIO UNITARIO]]","v":{"v":47.5,"d":"$47.50"}},{"v":47.5,"d":"$ 47.50"},0,{"$f":"Tabla1425[[#This Row],[EFECTIVO]]+Tabla1425[[#This Row],[TRANSFERENCIA]]","v":{"v":47.5,"d":"$ 47.50"}},"CANCELADO",{"$f":"Tabla1425[[#This Row],[VALOR A PAGAR]]-Tabla1425[[#This Row],[VALOR CANCELADO]]","v":0},{"$f":"Tabla1425[[#This Row],[VALOR A PAGAR]]*0.5","v":{"v":23.75,"d":"$ 23.75"}},{"$f":"Tabla1425[[#This Row],[VALOR A PAGAR]]-Tabla1425[[#This Row],[COSTO]]","v":{"v":23.75,"d":"$ 23.75"}}]
["2025-02-26","JR SPORT",1,{"v":2.5,"d":"$ 2.50"},{"$f":"Tabla1425[[#This Row],[CANT.]]*Tabla1425[[#This Row],[PRECIO UNITARIO]]","v":{"v":2.5,"d":"$2.50"}},{"v":2.5,"d":"$ 2.50"},0,{"$f":"Tabla1425[[#This Row],[EFECTIVO]]+Tabla1425[[#This Row],[TRANSFERENCIA]]","v":{"v":2.5,"d":"$ 2.50"}},"CANCELADO",{"$f":"Tabla1425[[#This Row],[VALOR A PAGAR]]-Tabla1425[[#This Row],[VALOR CANCELADO]]","v":0},{"$f":"Tabla1425[[#This Row],[VALOR A PAGAR]]*0.5","v":{"v":1.25,"d":"$ 1.25"}},{"$f":"Tabla1425[[#This Row],[VALOR A PAGAR]]-Tabla1425[[#This Row],[COSTO]]","v":{"v":1.25,"d":"$ 1.25"}}]
["2025-02-28","UNIVERSAL",5,{"v":2.5,"d":"$ 2.50"},{"$f":"Tabla1425[[#This Row],[CANT.]]*Tabla1425[[#This Row],[PRECIO UNITARIO]]","v":{"v":12.5,"d":"$12.50"}},0,{"v":12.5,"d":"$ 12.50"},{"$f":"Tabla1425[[#This Row],[EFECTIVO]]+Tabla1425[[#This Row],[TRANSFERENCIA]]","v":{"v":12.5,"d":"$ 12.50"}},"CANCELADO",{"$f":"Tabla1425[[#This Row],[VALOR A PAGAR]]-Tabla1425[[#This Row],[VALOR CANCELADO]]","v":0},{"$f":"Tabla1425[[#This Row],[VALOR A PAGAR]]*0.5","v":{"v":6.25,"d":"$ 6.25"}},{"$f":"Tabla1425[[#This Row],[VALOR A PAGAR]]-Tabla1425[[#This Row],[COSTO]]","v":{"v":6.25,"d":"$ 6.25"}},"PAGO EN DOS PARTES"]
["2025-02-28","KORYO",2,{"v":2.5,"d":"$ 2.50"},{"$f":"Tabla1425[[#This Row],[CANT.]]*Tabla1425[[#This Row],[PRECIO UNITARIO]]","v":{"v":5,"d":"$5.00"}},0,{"v":5,"d":"$ 5.00"},{"$f":"Tabla1425[[#This Row],[EFECTIVO]]+Tabla1425[[#This Row],[TRANSFERENCIA]]","v":{"v":5,"d":"$ 5.00"}},"CANCELADO",{"$f":"Tabla1425[[#This Row],[VALOR A PAGAR]]-Tabla1425[[#This Row],[VALOR CANCELADO]]","v":0},{"$f":"Tabla1425[[#This Row],[VALOR A PAGAR]]*0.5","v":{"v":2.5,"d":"$ 2.50"}},{"$f":"Tabla1425[[#This Row],[VALOR A PAGAR]]-Tabla1425[[#This Row],[COSTO]]","v":{"v":2.5,"d":"$ 2.50"}}]
["2025-03-11","ASOTKD - P CHIMBACALLE",1,{"v":2.5,"d":"$ 2.50"},{"$f":"Tabla1425[[#This Row],[CANT.]]*Tabla1425[[#This Row],[PRECIO UNITARIO]]","v":{"v":2.5,"d":"$2.50"}},0,{"v":2.5,"d":"$ 2.50"},{"$f":"Tabla1425[[#This Row],[EFECTIVO]]+Tabla1425[[#This Row],[TRANSFERENCIA]]","v":{"v":2.5,"d":"$ 2.50"}},"CANCELADO",{"$f":"Tabla1425[[#This Row],[VALOR A PAGAR]]-Tabla1425[[#This Row],[VALOR CANCELADO]]","v":0},{"$f":"Tabla1425[[#This Row],[VALOR A PAGAR]]*0.5","v":{"v":1.25,"d":"$ 1.25"}},{"$f":"Tabla1425[[#This Row],[VALOR A PAGAR]]-Tabla1425[[#This Row],[COSTO]]","v":{"v":1.25,"d":"$ 1.25"}}]
["2025-03-13","JR SPORT",2,{"v":2.5,"d":"$ 2.50"},{"$f":"Tabla1425[[#This Row],[CANT.]]*Tabla1425[[#This Row],[PRECIO UNITARIO]]","v":{"v":5,"d":"$5.00"}},{"v":5,"d":"$ 5.00"},0,{"$f":"Tabla1425[[#This Row],[EFECTIVO]]+Tabla1425[[#This Row],[TRANSFERENCIA]]","v":{"v":5,"d":"$ 5.00"}},"CANCELADO",{"$f":"Tabla1425[[#This Row],[VALOR A PAGAR]]-Tabla1425[[#This Row],[VALOR CANCELADO]]","v":0},{"$f":"Tabla1425[[#This Row],[VALOR A PAGAR]]*0.5","v":{"v":2.5,"d":"$ 2.50"}},{"$f":"Tabla1425[[#This Row],[VALOR A PAGAR]]-Tabla1425[[#This Row],[COSTO]]","v":{"v":2.5,"d":"$ 2.50"}}]
["TOTAL",null,{"$f":"SUM(C4:C46)","v":501},null,{"$f":"SUM(Tabla1425[VALOR A PAGAR])","v":{"v":1230.5,"d":"$1,230.50"}},{"$f":"SUM(F4:F46)","v":{"v":65.5,"d":"$65.50"}},{"$f":"SUM(G4:G46)","v":{"v":1165,"d":"$1,165.00"}},{"$f":"SUM(H4:H46)","v":{"v":1230.5,"d":"$1,230.50"}},null,null,{"$f":"SUM(K4:K46)","v":{"v":615.25,"d":"$615.25"}},{"$f":"SUM(L4:L46)","v":{"v":615.25,"d":"$615.25"}}]
[null,null,"DIPLOMAS ELABORADOS",null,"A RECAUDARSE","RECAUDADO EN EFECTIVO","RECAUDADO EN TRANSFERENCIA"]
[]
[]
[null,"RECAUDADO","MONTO"]
[null,"EFECTIVO",{"$f":"F47","v":{"v":65.5,"d":"$65.50"}}]
[null,"TRANSFERENCIA",{"$f":"G47","v":{"v":1165,"d":"$1,165.00"}}]
[null,"TOTAL",{"$f":"SUM(C52:C53)","v":{"v":1230.5,"d":"$1,230.50"}}]
[]
[]
[null,"POR COBRAR","MONTO"]
[]
[null,"TOTAL",{"$f":"SUM(C58:C58)","v":{"v":0,"d":"$0.00"}}]
[]
[]
[null,"DEVOLVER O HACER PASO","MONTO"]
[]
[null,"TOTAL",{"$f":"SUM(C63:C63)","v":{"v":0,"d":"$0.00"}}]

{"sheet":"III OPEN 2024","index":7,"n_rows":92,"n_cols":9,"rows_kept":92,"merged":[[0,0,0,8],[1,0,1,8],[2,0,2,8],[57,0,57,2],[60,1,60,2],[67,1,67,2]]}
["ASOCIACIÓN DE TAEKWONDO DE PICHINCHA"]
["TERCER OPEN TODAS LAS CATEGORIAS POOMSAE Y COMBATE "]
["16 - 17 DE NOVIEMBRE -2024 COLISEO RUMIÑAHUI"]
[]
["N°","CLUBES PARTICIPANTES","SIGLAS","Nº DE PARTICIPANTES","EFECTIVO","TRANSFERENCIA","INSCRIP. TARDÍA","CAMBIO","ESTADO"]
[1,"APOLO","APO",30,0,{"v":420,"d":"$420.00"},"-","-","PAGADO"]
[2,"ARES","ARE",24,{"v":280,"d":"$280.00"},{"v":56,"d":"$56.00"},"-","-","PAGADO"]
[3,"ASOCIACION DE TKDP","ASO",2,0,{"v":20,"d":"$20.00"},1,"-",14]
[4,"BAEKJUL TAEKWONDO","BKJ",55,{"v":770,"d":"$770.00"},0,"-","-","PAGADO"]
[5,"BAS PANTHERS","BSP",12,0,{"v":161,"d":"$161.00"},2,"-","PAGADO"]
[6,"BLUE DRAGONS","BDR",21,0,{"v":294,"d":"$294.00"},"-","-","PAGADO"]
[7,"BORJA’S LIONS","BLS",76,{"v":30,"d":"$30.00"},{"v":835,"d":"$835.00"},1,1,"PAGADO"]
[8,"CHAMPIONS FOR LIFE","CFL",12,{"v":160,"d":"$160.00"},0,"-","-","PAGADO"]
[9,"CIUDAD DE QUITO","CDQ",2,{"v":20,"d":"$20.00"},{"v":8,"d":"$8.00"},"-","-","PAGADO"]
[10,"DEBAK TKD","DBK",115,{"v":274,"d":"$274.00"},{"v":1000,"d":"$1,000.00"},"-","-","PAGADO"]
[11,"DOJANG TKD MELO","DTM",12,0,{"v":168,"d":"$168.00"},"-","-","PAGADO"]
[12,"DRACO","DRA",3,0,{"v":47,"d":"$47.00"},"-",1,"PAGADO"]
[13,"ECUADCUBA","ECB",42,{"v":588,"d":"$588.00"},0,"-","-","PAGADO"]
[14,"ECUADOR (2 rep)","ECU",12,0,{"v":152,"d":"$152.00"},"-","-","PAGADO"]
[15,"EQUILIBRIO","EQU",3,0,{"v":42,"d":"$42.00"},"-","-","PAGADO"]
[16,"ESPE Saldo a favor 348","ESP",10,0,0,3,"-","152 PASO"]
[17,"FITT KWONDO MEJIA","FIT",1,0,{"v":15,"d":"$15.00"},"-","-","PAGADO"]
[18,"FURIA NEGRA","CFN",8,{"v":80,"d":"$80.00"},{"v":32,"d":"$32.00"},"-","-","PAGADO"]
[19,"HIMCHARI DOJANG","HIM",34,0,{"v":481,"d":"$481.00"},"-",1,"PAGADO"]
[20,"ILYO M.P","ILY",20,{"v":293,"d":"$293.00"},0,2,1,"PAGADO"]
[21,"JIDOKWAN DC","JDK",2,{"v":28,"d":"$28.00"},0,"-","-","PAGADO"]
[22,"JOSEON LEGACY","JOL",12,{"v":40,"d":"$40.00"},{"v":128,"d":"$128.00"},"-","-","PAGADO"]
[23,"JUVENTUS","JUV",1,{"v":14,"d":"$14.00"},0,"-","-","PAGADO"]
[24,"KOREAN DRAGON ","KDR",6,0,{"v":84,"d":"$84.00"},"-","-","PAGADO"]
[25,"KUKKIWON","KUK",8,{"v":121,"d":"$121.00"},0,1,1,"PAGADO"]
[26,"KUMGANG DUL","KGD",17,{"v":58,"d":"$58.00"},{"v":200,"d":"$200.00"},5,"-","PAGADO"]
[27,"KYORUGUI GYM","KRG",7,{"v":98,"d":"$98.00"},0,"-","-","PAGADO"]
[28,"LDCM","LCM",10,0,{"v":140,"d":"$140.00"},"-","-","PAGADO"]
[29,"LEON","LEO",21,{"v":190,"d":"$190.00"},{"v":110,"d":"$110.00"},4,"-","PAGADO"]
[30,"LOS PUMAS","PUM",11,0,{"v":163,"d":"$163.00"},1,1,"PAGADO"]
[31,"MARCIAL CLU GRANDA","MCG",24,0,{"v":356,"d":"$356.00"},"-","-","PAGADO"]
[32,"MASTER HOME","MAH",2,{"v":28,"d":"$28.00"},0,"-","-","PAGADO"]
[33,"MERCENARIOS","MER",14,0,{"v":140,"d":"$140.00"},"-","-","PAGADO"]
[34,"MICHAYDO","MCD",3,0,{"v":42,"d":"$42.00"},"-","-","PAGADO"]
[35,"PYONGYANG","PYO",10,0,{"v":140,"d":"$140.00"},"-","-","PAGADO"]
[36,"ROJAS IAN IRON FIST","PVM",6,{"v":84,"d":"$84.00"},0,"-","-","PAGADO"]
[37,"RYONG TAE","RYT",1,{"v":14,"d":"$14.00"},0,"-","-","PAGADO"]
[38,"SAN FRANC TIGRE 1 pa","SFT",14,{"v":174,"d":"$174.00"},0,"-","-","PAGADO"]
[39,"SAN SEBASTIAN","SSB",23,0,{"v":320,"d":"$320.00"},3,"-","PAGADO"]
[40,"SEUL 1 para","SEU",65,{"v":10,"d":"$10.00"},{"v":886,"d":"$886.00"},"-",1,"PAGADO"]
[41,"SHOGUN","SHO",7,{"v":98,"d":"$98.00"},0,"-","-","PAGADO"]
[42,"S.D. CENTRAL 1 FEST","SDC",30,{"v":75,"d":"$75.00"},{"v":385,"d":"$385.00"},9,"-","PAGADO"]
[43,"SURYUN","SRY",47,{"v":316,"d":"$316.00"},{"v":210,"d":"$210.00"},4,"-","PAGADO"]
[44,"TAE BAEK JUNIOR","TBK",1,0,{"v":14,"d":"$14.00"},"-","-","PAGADO"]
[45,"TAE DO ACADEMY","TDO",4,0,{"v":56,"d":"$56.00"},"-","-","PAGADO"]
[46,"TAE SHO KU","TSK",5,0,{"v":100,"d":"$100.00"},"-","-","PAGADO"]
[47,"TAE WOONG","TWG",1,0,{"v":14,"d":"$14.00"},"-","-","PAGADO"]
[48,"TAEGUK JUCARO","TJD",17,{"v":180,"d":"$180.00"},{"v":58,"d":"$58.00"},"-","-","PAGADO"]
[49,"TOTAL KOMBAT 1 para","TKT",46,{"v":322,"d":"$322.00"},{"v":326,"d":"$326.00"},1,"-","PAGADO"]
[50,"TRAINING CENTER","TTC",39,0,{"v":598,"d":"$598.00"},2,1,"PAGADO"]
[51,"USFQ","USF",5,{"v":28,"d":"$28.00"},{"v":42,"d":"$42.00"},"-","-","PAGADO"]
[52,"UNIVERSIDAD UTE 1","UTE",1,0,{"v":14,"d":"$14.00"},"-","-","PAGADO"]
["TOTAL ",null,null,{"$f":"SUM(D6:D57)","v":954},{"$f":"SUM(E6:E57)","v":{"v":4373,"d":"$4,373.00"}},{"$f":"SUM(F6:F57)","v":{"v":8257,"d":"$8,257.00"}},{"$f":"SUM(G6:G57)","v":39},{"$f":"SUM(H6:H57)","v":8}]
[]
[]
[null,"INGRESOS"]
[null,"INSCRIPCIONES EFECTIVO",{"$f":"E58","v":{"v":4373,"d":"$ 4,373.00"}}]
[null,"INSCRIPCIONES TRANSFERENCIA",{"$f":"F58","v":{"v":8257,"d":"$ 8,257.00"}}]
[null,"TAQUILLA",{"v":1389,"d":"$ 1,389.00"}]
[null,"TOTAL",{"$f":"SUM(C62:C64)","v":{"v":14019,"d":"$ 14,019.00"}}]
[]
[]
[null,"EGRESOS"]
[null,"DEVOLUCIÓN TAESHOKU",{"v":30,"d":"$ 30.00"}]
[null,"4 COMUNICADORES (WOKI TOKI) FERNANDO MOYA",{"v":60,"d":"$ 60.00"},{"$nulls":4}," "]
[null,"TRANSPORTE TROFEOS MEDALLAS",{"v":10,"d":"$ 10.00"}]
[null,"PAGO ARBITRAJE  ",{"v":1780,"d":"$ 1,780.00"}]
[null,"PAGO SERVICIO DE SEGURIDAD (3 GUARDIAS)",{"v":90,"d":"$ 90.00"}]
[null,"ORGANIZACIÓN FESTIVAL MATEO PAZMIÑO",{"v":20,"d":"$ 20.00"}]
[null,"MEDICINAS",{"v":19.82,"d":"$ 19.82"}]
[null,"FUNDAS DE BASURA",{"v":5,"d":"$ 5.00"}]
[null,"STAFF (PERSONAL APOYO 3 DÍAS)",{"v":1240,"d":"$ 1,240.00"}]
[null,"STIKER PARA MEDALLAS",{"v":125,"d":"$ 125.00"}]
[null,"AGUAS",{"v":55.5,"d":"$ 55.50"}]
[null,"AMPLIFICACIÓN Y SONIDO",{"v":250,"d":"$ 250.00"}]
[null,"PAGO FERNANDO MOYA ",{"v":285,"d":"$ 285.00"}]
[null,"ALQUILER 3 SISTEMAS 2 DÍAS",{"v":300,"d":"$ 300.00"}]
[null,"PAGO DIRECCIÓN CONGRESILLO",{"v":20,"d":"$ 20.00"}]
[null,"ALQUILER SISTEMA VIDEO REPLAY",{"v":40,"d":"$ 40.00"}]
[null,"SISTEMA DE LLAVEAJE CÉSAR TAYO",{"v":998.6,"d":"$ 998.60"}]
[null,"MEDALLAS - TROFEOS",{"v":670,"d":"$ 670.00"}]
[null,"TOTAL",{"$f":"SUM(C69:C86)","v":{"v":5998.92,"d":"$ 5,998.92"}}]
[]
[]
[null,"INGRESOS",{"$f":"C65","v":{"v":14019,"d":"$ 14,019.00"}}]
[null,"EGRESOS",{"$f":"-C87","v":{"v":-5998.92,"d":"$ (5,998.92)"}}]
[null,"SALDO",{"$f":"C90+C91","v":{"v":8020.08,"d":"$ 8,020.08"}}]

{"sheet":"CHEQUEO TÉCNICO EDADES 2025","index":8,"n_rows":68,"n_cols":9,"rows_kept":68,"merged":[[0,0,0,8],[1,0,1,8],[2,0,2,8],[40,0,40,2],[43,1,43,2],[50,1,50,2]]}
["ASOCIACIÓN DE TAEKWONDO DE PICHINCHA"]
["CHEQUEO TÉCNICO EDADES 2025"]
["LABORATORIO DE VOLEIBOL 8-12-2024"]
[]
["N°","CLUBES PARTICIPANTES","SIGLAS","Nº DE PARTICIPANTES","INSCRIP. TARDÍA","CAMBIO","EFECTIVO","TRANSFERENCIA","ESTADO"]
[1,"ARES","ARE",2,0,1,{"v":15,"d":"$15.00"},0,"PAGADO"]
[2,"ASOTKDP","ASO",2,0,0,{"v":10,"d":"$10.00"},0,"PAGADO"]
[3,"BAEKJUL TKD","BKJ",13,0,0,{"v":65,"d":"$65.00"},0,"PAGADO"]
[4,"BAS PANTHERS","BSP",4,0,0,{"v":20,"d":"$20.00"},0,"PAGADO"]
[5,"BORJA’S LIONS - 3","BLS",21,0,1,0,{"v":95,"d":"$95.00"},"PAGADO"]
[6,"CHAMPIONS FOR LIFE","CFL",2,0,0,0,{"v":10,"d":"$10.00"},"PAGADO"]
[7,"CIUDAD DE QUITO","CDQ",2,0,0,0,{"v":10,"d":"$10.00"},"PAGADO"]
[8,"CLUB MERCENARIOS -2","MER",26,0,0,0,{"v":24,"d":"$24.00"},"PAGADO"]
[9,"CLUB  DECIAP ","DEC",12,0,0,{"v":60,"d":"$60.00"},0,"PAGADO"]
[10,"CLUB TAE WOONG","TWG",6,0,0,0,{"v":30,"d":"$30.00"},"PAGADO"]
[11,"DRACO","DRA",14,0,1,0,{"v":75,"d":"$75.00"},"PAGADO"]
[12,"ECUADCUBA","ECB",5,0,1,{"v":30,"d":"$30.00"},0,"PAGADO"]
[13,"FIRST CLASS CALDERON","FCE",2,0,0,0,{"v":10,"d":"$10.00"},"PAGADO"]
[14,"FURIA NEGRA","CFN",3,1,0,0,{"v":20,"d":"$20.00"},"PAGADO"]
[15,"HANSU CAYAMBE","CAY",1,0,0,{"v":5,"d":"$5.00"},0,"PAGADO"]
[16,"HUANG TOP GYM ","HTG",2,0,0,0,{"v":10,"d":"$10.00"},"PAGADO"]
[17,"ILYO M.P","ILY",1,0,0,0,0,"NO ASISTE"]
[18,"JIDOKWAN DC","JDK",2,0,0,{"v":10,"d":"$10.00"},0,"PAGADO"]
[19,"JR SPORT","JRS",1,0,0,{"v":5,"d":"$5.00"},0,"PAGADO"]
[20,"KO AMERICA","KOA",3,0,0,{"v":15,"d":"$15.00"},0,"PAGADO"]
[21,"KORYO","KOR",3,3,0,{"v":30,"d":"$30.00"},0,"PAGADO"]
[22,"KUMGANG DUL","KGD",3,0,1,{"v":20,"d":"$20.00"},0,"PAGADO"]
[23,"KYORUGUI GYM","KRG",5,0,0,{"v":25,"d":"$25.00"},0,"PAGADO"]
[24,"ROJAS IAN IRON FIST","PVM",5,0,0,{"v":25,"d":"$25.00"},0,"PAGADO"]
[25,"SAN SEBASTIAN ","SSB",5,0,0,{"v":10,"d":"$10.00"},{"v":15,"d":"$15.00"},"PAGADO"]
[26,"SEUL","SEU",22,0,1,{"v":105,"d":"$105.00"},{"v":10,"d":"$10.00"},"PAGADO"]
[27,"SHOGUN","OHS",1,0,0,{"v":5,"d":"$5.00"},0,"PAGADO"]
[28,"SIMJANG TEAM","SIM",2,0,0,{"v":10,"d":"$10.00"},0,"PAGADO"]
[29,"SDCENTRAL","SDC",28,1,0,{"v":145,"d":"$145.00"},0,"PAGADO"]
[30,"TAE BAEK","TBK",1,0,0,{"v":5,"d":"$5.00"},0,"PAGADO"]
[31,"TAE BAEK JUNIOR","TBK",12,0,2,0,{"v":70,"d":"$70.00"},"PAGADO"]
[32,"TAE DO ACADEMY","TDO",1,0,0,0,{"v":5,"d":"$5.00"},"PAGADO"]
[33,"TAE SHO KU","TSK",5,0,0,0,{"v":25,"d":"$25.00"},"PAGADO"]
[34,"USFQ","USF",3,0,0,0,{"v":15,"d":"$15.00"},"PAGADO"]
[35,"YONG TIGER -1","YON",10,0,0,{"v":30,"d":"$30.00"},{"v":17,"d":"$17.00"},"PAGADO"]
["TOTAL",null,null,{"$f":"SUM(D6:D40)","v":230},{"$f":"SUM(E6:E40)","v":5},{"$f":"SUM(F6:F40)","v":8},{"$f":"SUM(G6:G40)","v":{"v":645,"d":"$645.00"}},{"$f":"SUM(H6:H40)","v":{"v":441,"d":"$441.00"}}]
[]
[]
[null,"INGRESOS"]
[null,"INSCRIPCIONES EFECTIVO",{"$f":"G41","v":{"v":645,"d":"$ 645.00"}}]
[null,"INSCRIPCIONES TRANSFERENCIA",{"$f":"H41","v":{"v":441,"d":"$ 441.00"}}]
[null,"TAQUILLA",{"v":404,"d":"$ 404.00"}]
[null,"TOTAL",{"$f":"SUM(C45:C47)","v":{"v":1490,"d":"$ 1,490.00"}}]
[]
[]
[null,"EGRESOS"]
[null,"ESFÉROS",{"v":4,"d":"$ 4.00"}]
[null,"PRODUCTOS DE LIMPIEZA (PAPEL HIGIÉNICO Y FUNDAS)",{"v":7,"d":"$ 7.00"}]
[null,"HIDRATANTES, REFRIGERIO ÁRBITROS Y COMOPRA DE FOCO",{"v":28,"d":"$ 28.00"}]
[null,"DESAYUNOS STAFF Y ÁRBITROS",{"v":195,"d":"$ 195.00"}]
[null,"PAGO ARBITRAJE, TABLETS VIDEO REPLAY Y OTROS",{"v":590,"d":"$ 590.00"}]
[null,"STAFF VIDEO REPLAY",{"v":60,"d":"$ 60.00"}]
[null,"PAGO CONGRESILLO",{"v":20,"d":"$ 20.00"}]
[null,"ARREGLO DE LLAVES Y DÍA DE TRABAJO COMPETENCIA",{"v":80,"d":"$ 80.00"}]
[null,"MÉDICO",{"v":50,"d":"$ 50.00"}]
[null,"STAFF(PERSONAL DE APOYO)",{"v":380,"d":"$ 380.00"}]
[null,"COMPUTADORAS PARA USO DE SISTEMA ELECTRÓNICO",{"v":40,"d":"$ 40.00"}]
[null,"TOTAL",{"$f":"SUM(C52:C62)","v":{"v":1454,"d":"$ 1,454.00"}}]
[]
[]
[null,"INGRESOS",{"$f":"C48","v":{"v":1490,"d":"$ 1,490.00"}}]
[null,"EGRESOS",{"$f":"-C63","v":{"v":-1454,"d":"$ (1,454.00)"}}]
[null,"SALDO",{"$f":"C66+C67","v":{"v":36,"d":"$ 36.00"}}]

{"sheet":"CURSO ARBITRAJE 12-14 DIC 2024","index":9,"n_rows":102,"n_cols":10,"rows_kept":102,"merged":[[0,0,0,8],[1,0,1,8],[15,8,22,8],[74,1,74,2],[80,1,80,2],[95,1,95,2]]}
["CURSO DE ACREDITACIÓN ÁRBITROS 2025"]
[]
["NRO.","IDENTIFICACIÓN - NOMBRE","CAMISETA TALLA","CLUB","CASILLERO","P.EFECTIVO","P.TRANSFERENCIA","FOTO","COMPROBANTE"]
[1,"1755150578 - DEFAS ARCOS YADIRA JACQUELINE",null,"LDC\nRUMIÑAHUI","ARBITRO",0,{"v":40,"d":"$ 40.00"},null,"PAGA ELISO MORILLO DE 3 PARTICIPANTES"]
[2,"1755150628 - DEFAS ARCOS GISSELA NICOL",null,"LDC\nRUMIÑAHUI","ASPIRANTE",0,{"v":40,"d":"$ 40.00"}]
[3,"1722665930 - TAPIA\nPALOMEQUE KARENT NICOLE",36,"ARES","ARBITRO",{"v":40,"d":"$ 40.00"},0,null,"2024-12-12"]
[4,"1717275315 - PALMA AYALA JOSÉ DAVID",38,"ARES","ARBITRO",0,0,null,"2025-01-14"]
[5,"1717825960 - ARAUJO LLIVISACA\nALEJANDRO WLADIMIR","M","ARES","ASPIRANTE",{"v":40,"d":"$ 40.00"},0,null,"2024-12-12"]
[6,"1724911860 - MESIAS\nCHANATASI ALISON\nMONSERRATH",null,"ATLAS","ARBITRO",0,{"v":40,"d":"$ 40.00"}]
[7,"1721226452 - CHICAIZA RAMOS\nJONATHAN DAVID",null,"ATLAS","ARBITRO",{"v":40,"d":"$ 40.00"},0,null,"2024-12-12"]
[8,"1311953044 - ZAMBRANO GOMEZ\nVERÓNICA ELIZABETH",null,"BAEKJUL TAEKWONDO","OYENTE",0,{"v":20,"d":"$ 20.00"}]
[9,"1719346676 - PROAÑO\nPAREDES ERICK DANILO",44,"BAEKJUL TAEKWONDO","OYENTE",0,{"v":20,"d":"$ 20.00"}]
[10,"1721834958 - PROAÑO PAREDES JOHANN\nNATANIEL",44,"BAEKJUL TAEKWONDO","OYENTE",0,{"v":20,"d":"$ 20.00"}]
[11,"1712968914 - AYALA MOYA\nDANIEL ENRIQUE",42,"BAEKJUL TAEKWONDO","OYENTE",0,{"v":20,"d":"$ 20.00"}]
[12,"1754170643 - OSCULLO MARCILLO PAULETTE JUSTINE",null,"BAS\nPANTHERS","OYENTE",0,{"v":20,"d":"$ 20.00"}]
[13,"1754174587 - OSCULLO MARCILLO ZULAY ANAHÍ",null,"BAS\nPANTHERS","OYENTE",0,{"v":20,"d":"$ 20.00"},null,"UN SOLO PAGO"]
[14,"1755810940 - CHAVARRIA\nGONZA JENIFER ELISABETH",null,"BAS\nPANTHERS","OYENTE",0,{"v":20,"d":"$ 20.00"}]
[15,"0802811380 -\nPORTOCARRERO LASTRA GABRIELA JOCELYN",null,"BAS\nPANTHERS","OYENTE",0,{"v":20,"d":"$ 20.00"}]
[16,"1727294389 - BASTIDAS\nPORTOCARRERO BETTY JAMILETH",null,"BAS\nPANTHERS","OYENTE",0,{"v":20,"d":"$ 20.00"}]
[17,"1753219359 - NAVARRETE AYALA\nSAMANTHA PAOLA",null,"BAS\nPANTHERS","OYENTE",0,{"v":20,"d":"$ 20.00"}]
[18,"1727869446 - BASTIDAS\nPORTOCARRERO LARISSA GABRIELA",null,"BAS\nPANTHERS","OYENTE",0,{"v":20,"d":"$ 20.00"}]
[19,"1727869461 - BASTIDAS\nPORTOCARRERO DARLING\nALEXANDRA",null,"BAS\nPANTHERS","OYENTE",0,{"v":20,"d":"$ 20.00"}]
[20,"1709834079 - BASTIDAS\nBETAUNCOURT JONATAN\nALEXANDER",null,"BAS\nPANTHERS","OYENTE",0,{"v":20,"d":"$ 20.00"}]
[21,"1723045470 - LAZO QUIÑA DANIEL FERNANDO",null,"CHAMPIONS FOR LIFE","ARBITRO",0,{"v":40,"d":"$ 40.00"}]
[22,"1717472847 - MOROCHO\nACHIG CARLOS ANDRES",38,"CHUNG SONG","ARBITRO",0,{"v":40,"d":"$ 40.00"}]
[23,"1850271485 - MANZANO CARDENAS\nSCARLET BELEN",36,"CHUNG SONG","ARBITRO",0,{"v":40,"d":"$ 40.00"}]
[24,"1706324082 -\nALVEAR GRANDA SANDRA LUCÍA",null,"DOJANG TKD MELO","OYENTE",0,{"v":20,"d":"$ 20.00"}]
[25,"1707456081 - MELO CARRERA BOLIVAR VINICIO",40,"DOJANG TKD MELO","OYENTE",0,{"v":20,"d":"$ 20.00"}]
[26,"1750122440 - BASTIDAS ULCUANGO\nGILARY BRIGITTE",null,"ECUADCUBA","ARBITRO",{"v":20,"d":"$ 20.00"},0,null,"2024-12-12"]
[27,"1726007618 - BASTIDAS\nALMACHI DANIEL LEONARDO",null,"ECUADCUBA","ARBITRO",{"v":20,"d":"$ 20.00"},0,null,"2024-12-12"]
[28,"1725453318 - ROSERO ALBAN\nCHRISTIAN MARTIN","XL","EQUILIBRIO","ARBITRO",0,{"v":40,"d":"$ 40.00"}]
[29,"1726565151 - ANRANGO\nCUSICAGUA KEVIN DAVID","M","EQUILIBRIO","OYENTE",0,{"v":20,"d":"$ 20.00"}]
[30,"1715861652 - ROJAS\nPORTERO JOSUE MESIAS",null,"ESPE","ARBITRO",0,{"v":40,"d":"$ 40.00"}]
[31,"1712828738 - DELCASTILLO MURGUEITIO DAVID .",40,"JIDOKWAN DC","ARBITRO",0,{"v":40,"d":"$ 40.00"}]
[32,"1718423450 - VIANA TIMBIANO\nVLADIMIR FERNANDO",38,"JOSEON LEGACY","ARBITRO",0,{"v":40,"d":"$ 40.00"}]
[33,"1719515676 - CUJILEMA\nYAUCAN LUIS GEOVANY",null,"JOSEON LEGACY","ARBITRO",0,{"v":40,"d":"$ 40.00"}]
[34,"1751948587 - FREIRE LUJE\nELLIOTH ISRAEL",null,"JOSEON LEGACY","ARBITRO",0,{"v":40,"d":"$ 40.00"}]
[35,"0401586615 - NARVAEZ REINA\nJOSE DAVID",null,"JOSEON LEGACY","ARBITRO",0,{"v":40,"d":"$ 40.00"}]
[36,"1724606817 - ACOSTA CANDO\nDANNA PRISCILA",null,"JOSEON LEGACY","ASPIRANTE",{"v":40,"d":"$ 40.00"},0,null,"2024-12-12"]
[37,"1751161488 - CASTRO MANTILLA\nANTHONY JOSUE",null,"JOSEON LEGACY","ASPIRANTE",{"v":40,"d":"$ 40.00"},0,null,"2024-12-12"]
[38,"1712539954 - NICOLALDE DE LA TORRE JAIME\nANDRES",null,"JR SPORT","OYENTE",0,{"v":20,"d":"$ 20.00"},null,"2025-01-15"]
[39,"1721620027 - ARMIJOS ARMIJOS\nRAQUEL ANDREA",null,"JR SPORT","ARBITRO",0,0,null,"BECADA POR STAFF "]
[40,"1712324928 - PAVÓN FLORES JHONNY FRANKLIN",null,"JUVENTUS","ARBITRO","EXONERADO",0,null,"EXPOSITOR"]
[41,"1726859059 - MORILLO JIMENEZ DIEGO ELISEO",null,"JUVENTUS","ARBITRO",0,{"v":40,"d":"$ 40.00"}]
[42,"1708640097 - HERRERA\nSIMBAÑA MIRIAN ALEXANDRA",null,"JUVENTUS","ARBITRO","EXONERADO",0]
[43,"1712695723 - ROMAN\nTARAGUAY FABIAN\nERNESTO",null,"JUVENTUS","ARBITRO",0,{"v":40,"d":"$ 40.00"}]
[44,"0603601964 - PARRA\nBERRONES NOE SAUL",null,"JUVENTUS","ARBITRO",0,{"v":40,"d":"$ 40.00"}]
[45,"1757867831 - DUAN . YUXI .",null,"JUVENTUS","ASPIRANTE",0,{"v":40,"d":"$ 40.00"}]
[46,"1714865613 - CORDERO A ANGELO G",null,"KO AMERICA","ARBITRO",0,{"v":40,"d":"$ 40.00"}]
[47,"1723793129 - MOSQUERA FUENTES ERIKA DAYANA",null,"KORYO","ARBITRO",{"v":40,"d":"$ 40.00"},0,null,"2024-12-13"]
[48,"1714141916 - LUNA ARELLANO JENNY JANINA","M","LEON","ARBITRO",0,{"v":40,"d":"$ 40.00"}]
[49,"1727363986 - GAVILANEZ PAUCAR JOE ALEXANDER",null,"LOS PUMAS","ARBITRO",0,{"v":40,"d":"$ 40.00"}]
[50,"1710530914 - RIVERA\nPAREDES MARCO VINICIO",null,"SEUL","ARBITRO",{"v":40,"d":"$ 40.00"},0]
[51,"1753402948 - ALMEIDA INTRIAGO\nMATIAS PEDRO",null,"SEUL","ARBITRO",0,{"v":40,"d":"$ 40.00"}]
[52,"1729194090 - MAYORGA\nRAMIREZ ARELIZ GISELLE",null,"SEUL","ARBITRO",0,{"v":40,"d":"$ 40.00"}]
[53,"1712405800 - GARZON IBARRA GALO PATRICIO",null,"SEUL","OYENTE",0,{"v":20,"d":"$ 20.00"}]
[54,"1725768483 - ROJAS PIZARRO DEMITER RAUL",null,"SEUL","OYENTE",0,{"v":20,"d":"$ 20.00"}]
[55,"1727666180 -\nPEREZ CAMPAÑA JHOSET JAVIER",null,"SOCIEDAD DEPORTIVA CENTRAL","ARBITRO",0,{"v":40,"d":"$ 40.00"},null,"2024-12-16"]
[56,"2350041410 - TULCÁN\nCEDEÑO MATHEU FELIPE",null,"SOCIEDAD DEPORTIVA CENTRAL","ARBITRO",{"v":40,"d":"$ 40.00"},0,null,"2024-12-12"]
[57,"1713277570 - MORAN\nVASQUEZ JOSE GUILLERMO",40,"SOCIEDAD DEPORTIVA CENTRAL","ARBITRO",{"v":40,"d":"$ 40.00"},0,null,"2024-12-12"]
[58,"1709686107 - ASTUDILLO\nSALINAS JORGE EDUARDO",null,"TAE KINGS","ARBITRO",{"v":20,"d":"$ 20.00"},0,null,"SALDO $20","NO SE ACREDITA"]
[59,"2200513063 - ESTRELLA ESCOBAR GISSELL\nDOMENICA",null,"TAE SHO KU","ARBITRO",0,0,null,"PAGA EN ENERO","NO SE ACREDITA"]
[60,"1721340535 - SIGCHA CRUZ\nSHIRLEY ODALIS",null,"TAE SHO KU","ARBITRO",0,{"v":40,"d":"$ 40.00"}]
[61,"1726311416 - GRANDE\nVELÁSQUEZ JULISA LIZBETH",40,"TIGRE G","ASPIRANTE",0,0,null,"NO ASISTE","NO SE ACREDITA"]
[62,"1723254858 - GUERRA\nVELASQUEZ SIMON BOLIVAR",null,"TIGRE G","ASPIRANTE",0,0,null,"NO ASISTE","NO SE ACREDITA"]
[63,"MARY MANZANO",null,"JUVENTUS","ARBITRO",0,{"v":40,"d":"$ 40.00"},null,null,"SIN REGISTRO EN PÁGINA"]
[64,"HUGO SIGCHOS",null,"PYONGYANG","ARBITRO",{"v":40,"d":"$ 40.00"},0,null,null,"SIN REGISTRO EN PÁGINA"]
[65,"DYLAN SALAZAR",null,"DRACO","ARBITRO",0,0,null,"PAGO PENDIENTE","NO SE ACREDITA"]
[66,"PEDRO OÑA",null,"SAN SEBASTIAN","ARBITRO",{"v":25,"d":"$ 25.00"},0,null,"SALDO $15","NO SE ACREDITA"]
[{"$nulls":4},"TOTAL:",{"$f":"SUM(F4:F69)","v":{"v":485,"d":"$ 485.00"}},{"$f":"SUM(G4:G69)","v":{"v":1380,"d":"$ 1,380.00"}}]
[]
[]
[]
[]
[null,"INGRESOS"]
[null,"INSCRIPCIONES EFECTIVO",{"$f":"F70","v":{"v":485,"d":"$ 485.00"}}]
[null,"INSCRIPCIONES TRANSFERENCIA",{"$f":"G70","v":{"v":1380,"d":"$ 1,380.00"}}]
[null,"TOTAL",{"$f":"SUM(C76:C77)","v":{"v":1865,"d":"$ 1,865.00"}}]
[]
[]
[null,"EGRESOS"]
[null,"CAFETERÍA PRIMER DÍA",{"v":7,"d":"$ 7.00"}]
[null,"HIDRATACIÓN EXPOSITORES Y CAFETERÍA SEGUNDO DÍA ",{"v":20,"d":"$ 20.00"}]
[null,"PAGO NOV - DIC RUTH GUANO",{"v":325,"d":"$ 325.00"}]
[null,"IMPRESIÓN DIPLOMAS MEJORES DEPORTISTAS 2024 (13-12-2024)",{"v":130,"d":"$ 130.00"}]
[null,"TAXI SALÓN DE LA CIUDAD PREMIACIÓN MEJORES DEPORTISTAS 2024 (16-12-2024)",{"v":3,"d":"$ 3.00"}]
[null,"PAGO EXPOSITORES",{"v":600,"d":"$ 600.00"},"CHEQUE EMITIDO EN ENERO"]
[null,"TOTAL",{"$f":"SUM(C82:C87)","v":{"v":1085,"d":"$ 1,085.00"}}]
[]
[]
[null,"INGRESOS",{"$f":"C78","v":{"v":1865,"d":"$ 1,865.00"}}]
[null,"EGRESOS",{"$f":"-C88","v":{"v":-1085,"d":"$ (1,085.00)"}}]
[null,"SALDO",{"$f":"C91+C92","v":{"v":780,"d":"$ 780.00"}}]
[]
[]
[null,"POR COBRAR"]
[null,"CLUB","VALOR"]
[null,"TAE KING'S (JORGE ASTUDILLO)",{"v":20,"d":"$ 20.00"},"SE DESCUENTA DE EVENTOS DONDE ARBITREN"]
[null,"TAE SHO KU (ESTRELLA GISSELL)",{"v":40,"d":"$ 40.00"},"SE DESCUENTA DE EVENTOS DONDE ARBITREN"]
[null,"SAN SEBASTIÁN (PEDRO OÑA)",{"v":15,"d":"$ 15.00"},"SE DESCUENTA DE EVENTOS DONDE ARBITREN"]
[null,"DRACO (DILAN SALAZAR)",{"v":40,"d":"$ 40.00"},"SE DESCUENTA DE EVENTOS DONDE ARBITREN"]
[null,"TOTAL",{"$f":"SUBTOTAL(9,C98:C101)","v":{"v":115,"d":"$ 115.00"}}]

{"sheet":"ACREDITACIÓN ENTRENADORES 2025","index":10,"n_rows":492,"n_cols":8,"rows_kept":492,"merged":[[0,0,0,6],[1,0,1,6],[2,0,2,6],[448,0,448,3],[451,1,451,2],[486,1,486,2]]}
["ASOCIACIÓN DE TAEKWONDO DE PICHINCHA"]
["CURSO DE ACREDITACIÓN DE ENTRENADORES 2025"]
["DE 15 AL 19 DE ENERO "]
[]
["N°","IDENTIFICACIÓN - NOMBRE","CLUB","SE ACREDITA COMO","EFECTIVO","TRANSFERENCIA","ESTADO"]
[1,"1710105667 - PINTO CAMPOVERDE MARIO XAVIER","APOLO","DIRECTOR CLUB FILIAL",{"v":30,"d":"$30.00"},0,"PAGADO"]
[2,"1726834607 - GUALOTO SIMBAÑA JONATHAN SMITLD","APOLO","MONITOR CLUB FILIAL",{"v":30,"d":"$30.00"},0,"DEBE 10"]
[3,"1725995474 - MALLA GARCIA JONATHAN ANDRES","APOLO","MONITOR CLUB FILIAL",{"v":20,"d":"$20.00"},0,"DEBE 20"]
[4,"1714194832 - VASCONEZ  PUMAYO EDGAR EDUARDO","APOLO","MONITOR CLUB FILIAL",0,{"v":40,"d":"$40.00"},"PAGADO"]
[5,"1707656862 - LLANQUI FLORES CARMEN ROSARIO","APOLO","MONITOR CLUB FILIAL",{"v":20,"d":"$20.00"},0,"DEBE 20"]
[6,"1711040947 - QUISHPE OÑA JOSE GUSTAVO","APOLO","ENTRENADOR CLUB FILIAL",{"v":20,"d":"$20.00"},0,"DEBE 20"]
[7,"1720161031 - GUALLICHICO COLLAGUAZO EDISON XAVIER","APOLO","ENTRENADOR CLUB FILIAL",{"v":20,"d":"$20.00"},0,"DEBE 20"]
[8,"1720705209 - TATIANA VANESSA SUAREZ FLORES","APOLO","ENTRENADOR CLUB FILIAL",{"v":20,"d":"$20.00"},0,"DEBE 20"]
[9,"1711459816 - JEREZ MERINO RICARDO NICOLAS","APOLO","ENTRENADOR CLUB FILIAL",{"v":20,"d":"$20.00"},0,"DEBE 20"]
[10,"1725489999 - ALVARADO ANDY ELY JAVIANA","APOLO","ENTRENADOR CLUB FILIAL",{"v":20,"d":"$20.00"},0,"DEBE 20"]
[11,"1716600273 - MANOSALVAS MANOSALVAS  WILSON FERNANDO","ARES","DIRECTOR CLUB FILIAL",0,{"v":30,"d":"$30.00"},"PAGADO"]
[12,"1751796283 - TORRES JUMBO GEOVANNA LIZBETH","ARES","MONITOR CLUB FILIAL",{"v":40,"d":"$40.00"},0,"PAGADO"]
[13,"1751935493 - MANOSALVAS  FARINANGO  ZAID  RICARDO","ARES","MONITOR CLUB FILIAL",{"v":40,"d":"$40.00"},0,"PAGADO"]
[14,"1750847582 - MALITAXI  RAMIREZ  ALEXANDER  DANIEL","ARES","MONITOR CLUB FILIAL",{"v":40,"d":"$40.00"},0,"PAGADO"]
[15,"1751159094 - MOSCOSO LARCO DIEGO ALEXANDER","ARES","MONITOR CLUB FILIAL",{"v":40,"d":"$40.00"},0,"PAGADO"]
[16,"1724383680 - MOLINA VELASQUEZ KEVIN RAUL","ARES","ENTRENADOR CLUB FILIAL",{"v":40,"d":"$40.00"},0,"PAGADO"]
[17,"1726222308 - PEDRAZA PILATAXI DILAN JOSUE","ARES","ENTRENADOR CLUB FILIAL",{"v":40,"d":"$40.00"},0,"PAGADO"]
[18,"1723201586  - NEPAS  MANOSALVAS  JOSÉ PATRICIO","ARES","ENTRENADOR CLUB FILIAL",{"v":40,"d":"$40.00"},0,"PAGADO"]
[19,"1717825960 - ARAUJO LLIVISACA ALEJANDRO WLADIMIR","ARES","ENTRENADOR CLUB FILIAL",0,{"v":40,"d":"$40.00"},"PAGADO"]
[20,"1722199203 - INAQUIZA  CAJAMARCA JOSE MARCELO","ARES","ENTRENADOR CLUB FILIAL",0,{"v":40,"d":"$40.00"},"PAGADO"]
[21,"1721519450 - FARINANGO  PICHUCHO LILIANA ELIZABETH","ARES","ENTRENADOR CLUB FILIAL",0,{"v":40,"d":"$40.00"},"PAGADO"]
[22,"1712539954 - NICOLALDE DE LA TORRE JAIME ANDRES","ASOCIACION DE TKDP","DIRECTOR CLUB FILIAL",0,{"v":40,"d":"$40.00"},"PAGADO"]
[23,"1804026464 - MAGALLANES VELA CARLOS EFREN","ASOCIACION DE TKDP","ENTRENADOR CLUB FILIAL",0,{"v":40,"d":"$40.00"},"PAGADO"]
[24,"1717969594 - VARELA TORRES XAVIER ANDRES","ATLAS","DIRECTOR CLUB FILIAL",0,{"v":30,"d":"$30.00"},"PAGADO"]
[25,"1716490493 - CHANATASI VARELA MARIA FERNANDA","ATLAS","ENTRENADOR CLUB FILIAL",0,{"v":40,"d":"$40.00"},"PAGADO"]
[26,"1712136520 - PROAÑO CASTRO JORGE WASHINGTON","BAEKJUL TAEKWONDO","DIRECTOR CLUB FILIAL",0,{"v":30,"d":"$30.00"},"PAGADO"]
[27,"1311953044 - ZAMBRANO GOMEZ VERÓNICA  ELIZABETH","BAEKJUL TAEKWONDO","MONITOR CLUB FILIAL",{"v":40,"d":"$40.00"},0,"PAGADO"]
[28,"1713041521 - FERNANDEZ CUERVO FREDDY PAUL","BAEKJUL TAEKWONDO","ENTRENADOR CLUB FILIAL",0,{"v":30,"d":"$30.00"},"PAGADO"]
[29,"1719346676 - PROAÑO PAREDES ERICK DANILO","BAEKJUL TAEKWONDO","ENTRENADOR CLUB FILIAL",0,{"v":40,"d":"$40.00"},"PAGADO"]
[30,"1750904300 - AYALA ZAMBRANO DANIEL ALEJANDRO","BAEKJUL TAEKWONDO","ENTRENADOR CLUB FILIAL",{"v":40,"d":"$40.00"},0,"PAGADO"]
[31,"1721834958 - PROAÑO PAREDES JOHANN NATANIEL","BAEKJUL TAEKWONDO","ENTRENADOR CLUB FILIAL",0,{"v":40,"d":"$40.00"},"PAGADO"]
[32,"1802440964 - ALARCON QUIÑONES CARLOS EFRAIN","BAEKJUL TAEKWONDO","ENTRENADOR CLUB FILIAL",0,{"v":40,"d":"$40.00"},"PAGADO"]
[33,"1709834079 - BASTIDAS BETAUNCOURT JONATAN ALEXANDER","BAS PANTHERS","DIRECTOR CLUB FILIAL",{"v":30,"d":"$30.00"},0,"PAGADO"]
[34,"1307088250 - SUAREZ ORTEGA WILIAN VICENTE","BAS PANTHERS","MONITOR CLUB FILIAL",{"v":40,"d":"$40.00"},0,"PAGADO"]
[35,"1754170643 - OSCULLO  MARCILLO  PAULETTE  JUSTINE","BAS PANTHERS","MONITOR CLUB FILIAL",{"v":40,"d":"$40.00"},0,"PAGADO"]
[36,"1754174587 - OSCULLO  MARCILLO  ZULAY ANAHÍ","BAS PANTHERS","MONITOR CLUB FILIAL",{"v":40,"d":"$40.00"},0,"PAGADO"]
[37,"1755810940 - CHAVARRIA  GONZA JENIFER ELISABETH","BAS PANTHERS","MONITOR CLUB FILIAL",{"v":40,"d":"$40.00"},0,"PAGADO"]
[38,"0802811380 - PORTOCARRERO LASTRA GABRIELA JOCELYN","BAS PANTHERS","MONITOR CLUB FILIAL",{"v":40,"d":"$40.00"},0,"PAGADO"]
[39,"1727294389 - BASTIDAS PORTOCARRERO BETTY  JAMILETH","BAS PANTHERS","ENTRENADOR CLUB FILIAL",{"v":40,"d":"$40.00"},0,"PAGADO"]
[40,"1717312068 - SUNTAXI CRISANTO  WILLIAM VINICIO","BLUE DRAGONS","DIRECTOR CLUB FILIAL",0,{"v":30,"d":"$30.00"},"PAGADO"]
[41,"1750879957 - PANTOJA  RIVADENEIRA JULIAN  ALESSANDRO","BLUE DRAGONS","MONITOR CLUB FILIAL",0,{"v":40,"d":"$40.00"},"PAGADO"]
[42,"1751182658 - PILACUAN ROJAS KENNY ALEJANDRO","BLUE DRAGONS","MONITOR CLUB FILIAL",0,{"v":40,"d":"$40.00"},"PAGADO"]
[43,"1752060036 - PALTAN  ITURRALDE MARÍA GRACIA GRACIA","BLUE DRAGONS","MONITOR CLUB FILIAL",0,{"v":40,"d":"$40.00"},"PAGADO"]
[44,"1750085720 - PALTAN ITURRALDE EMILIA ALEJANDRA","BLUE DRAGONS","MONITOR CLUB FILIAL",0,{"v":40,"d":"$40.00"},"PAGADO"]
[45,"1718162850 - MADERO GUERRERO ROBERTO ALEJANDRO","BLUE DRAGONS","ENTRENADOR CLUB FILIAL",0,{"v":40,"d":"$40.00"},"PAGADO"]
[46,"1750015388 - TUFIÑO MONTENEGRO NATALIA ISIS","BLUE DRAGONS","ENTRENADOR CLUB FILIAL",0,{"v":40,"d":"$40.00"},"PAGADO"]
[47,"1719867929 - SUNTAXI CRISANTO STALIN LUIS FABRIZZIO","BLUE DRAGONS","ENTRENADOR CLUB FILIAL",0,{"v":40,"d":"$40.00"},"PAGADO"]
[48,"1713509006 - BORJA MINA EDGAR ANIBAL","BORJA’S LIONS","DIRECTOR CLUB FILIAL",0,{"v":30,"d":"$30.00"},"PAGADO"]
[49,"1720600194 - NARANJO HERRERA MARÍA BELÉN","BORJA’S LIONS","MONITOR CLUB FILIAL",0,{"v":40,"d":"$40.00"},"PAGADO"]
[50,"0504309881 - ORTEGA RENDON PABLO EMILIO","BORJA’S LIONS","MONITOR CLUB FILIAL",0,{"v":40,"d":"$40.00"},"PAGADO"]
[51,"L179252 - RODRÍGUEZ  RODRÍGUEZ  YANICE -","BORJA’S LIONS","ENTRENADOR CLUB FILIAL",0,{"v":40,"d":"$40.00"},"PAGADO"]
[52,"0908176662 - ANDRADE LOPEZ HECTOR JAVIER","BORJA’S LIONS","ENTRENADOR CLUB FILIAL",0,{"v":40,"d":"$40.00"},"PAGADO"]
[53,"1713817219 - SEGOVIA SANCHEZ ANGELICA ELIZABETH","BORJA’S LIONS","ENTRENADOR CLUB FILIAL",0,{"v":40,"d":"$40.00"},"PAGADO"]
[54,"1719310581 - RAMOS SEGOVIA DILAN  JOSUE","BORJA’S LIONS","ENTRENADOR CLUB FILIAL",0,{"v":40,"d":"$40.00"},"PAGADO"]
[55,"1758378119 - ANDRADE CASTILLON ADRIAN DAVID","BORJA’S LIONS","OYENTE",0,{"v":10,"d":"$10.00"},"PAGADO"]
[56,"1725075004 - ROLDAN VINUEZA JORGE DAVID","CAMU","MONITOR CLUB FILIAL",0,{"v":40,"d":"$40.00"},"PAGADO"]
[57,"1750045229 - ALCIVAR ANRANGO HECTOR JOEL","CAMU","ENTRENADOR CLUB FILIAL",0,{"v":40,"d":"$40.00"},"PAGADO"]
[58,"1718546284 - GUAMANGATE CHICAIZA SOFIA TATIANA","CAMU","ENTRENADOR CLUB FILIAL",0,{"v":40,"d":"$40.00"},"PAGADO"]
[59,"1714409230 - MORETA SEVILLANO LUIS WLADIMIR","CAMU","ENTRENADOR CLUB FILIAL",0,{"v":40,"d":"$40.00"},"PAGADO"]
[60,"1720525516 - OCAPANA QUISAGUANO ANDERSON JOSUE","CAMU","ENTRENADOR CLUB FILIAL",0,{"v":40,"d":"$40.00"},"PAGADO"]
[61,"1717129793 - MUZO  MAISINCHO JONATHAN RODRIGO","CAMU","ENTRENADOR CLUB FILIAL",0,{"v":40,"d":"$40.00"},"PAGADO"]
[62,"1715270144 - BERRONES QUISHPE BYRON HERNAN","CHAMPIONS FOR LIFE","DIRECTOR CLUB FILIAL",0,{"v":30,"d":"$30.00"},"PAGADO"]
[63,"1725351959 - QUEZADA SANCHEZ JOHN ALEJANDRO","CHAMPIONS FOR LIFE","ENTRENADOR CLUB FILIAL",0,{"v":40,"d":"$40.00"},"PAGADO"]
[64,"1723045470 - LAZO QUIÑA DANIEL FERNANDO","CHAMPIONS FOR LIFE","ENTRENADOR CLUB FILIAL",0,{"v":40,"d":"$40.00"},"PAGADO"]
[65,"1717472847 - MOROCHO ACHIG CARLOS ANDRES","CHUNG SONG","DIRECTOR CLUB FILIAL",0,{"v":30,"d":"$30.00"},"PAGADO"]
[66,"1726161704 - MOROCHO ACHIG JOHANNA ESTEFANIA","CHUNG SONG","ENTRENADOR CLUB FILIAL",0,{"v":40,"d":"$40.00"},"PAGADO"]
[67,"1717466724 - CALUCHO RODRIGUEZ CARLOS MARCELO","CHUNG SONG","ENTRENADOR CLUB FILIAL",0,{"v":40,"d":"$40.00"},"PAGADO"]
[68,"1705525374 - JARAMILLO TRUJILLO FERNANDO CARLOS","CIUDAD DE QUITO","DIRECTOR CLUB FILIAL",0,{"v":30,"d":"$30.00"},"PAGADO"]
[69,"1724609217 - OBANDO  GODOY ADRIANA PILAR","CIUDAD DE QUITO","ENTRENADORCLUB FILIAL",0,{"v":40,"d":"$40.00"},"PAGADO"]
[71,"1754449906 - LARCO FLORES DEREK NOCOLAI","CIUDAD DE QUITO","MONITOR CLUB FILIAL",0,{"v":40,"d":"$40.00"},"PAGADO"]
[72,"1716475783 - CANO MEJIA LUIS ANIBAL","CLUB MERCENARIOS","DIRECTOR CLUB FILIAL",0,{"v":30,"d":"$30.00"},"PAGADO"]
[73,"1727945303 - MENDEZ MALDONADO ALEXIS JHEIMY","CLUB MERCENARIOS","MONITOR CLUB FILIAL",0,{"v":40,"d":"$40.00"},"PAGADO"]
[74,"1114313041 - MEJIA VASQUEZ JHON STEVEN","CLUB MERCENARIOS","MONITOR CLUB FILIAL",0,{"v":40,"d":"$40.00"},"PAGADO"]
[75,"1755127345 - TOAPANTA VILLAMARIN DYLAN JAHIR","CLUB MERCENARIOS","MONITOR CLUB FILIAL",0,{"v":40,"d":"$40.00"},"PAGADO"]
[76,"1725432585 - CARILLO AIMACAÑA LENIN ANDRES","CLUB MERCENARIOS","MONITOR CLUB FILIAL",0,{"v":40,"d":"$40.00"},"PAGADO"]
[77,"1752112951 - LOPEZ ROMERO FERNANDA MISHELL","CLUB MERCENARIOS","MONITOR CLUB FILIAL",0,{"v":40,"d":"$40.00"},"PAGADO"]
[78,"1756884000 - MERIZALDE SN EMILY SN","CLUB MERCENARIOS","MONITOR CLUB FILIAL",0,{"v":40,"d":"$40.00"},"PAGADO"]
[79,"1726862194 - FELIX VILLEGAS SHANIA FIORELLA","CLUB MERCENARIOS","MONITOR CLUB FILIAL",0,{"v":40,"d":"$40.00"},"PAGADO"]
[80,"1752729101 - PILATUÑA LINCANGO SANTIAGO EDY","CLUB MERCENARIOS","MONITOR CLUB FILIAL",{"v":4,"d":"$4.00"},{"v":40,"d":"$40.00"},"PAGADO"]
[81,"1726586629 - VEINTIMILLA YANEZ GENESIS ABIGAIL","CLUB MERCENARIOS","ENTRENADOR CLUB FILIAL",0,{"v":40,"d":"$40.00"},"PAGADO"]
[82,"1752112720 - CANO CARDONA SEBASTIAN JUAN","CLUB MERCENARIOS","ENTRENADOR CLUB FILIAL",0,{"v":40,"d":"$40.00"},"PAGADO"]
[83,"1709735342 - TAYO DUQUE PABLO AURELIO","C. A. R. DECIAP","DIRECTOR CLUB FILIAL",0,{"v":30,"d":"$30.00"},"PAGADO"]
[84,"1753716875 - GARCIA ORTUÑO SANTIAGO JAVIER","C. A. R. DECIAP","MONITOR CLUB FILIAL",0,{"v":40,"d":"$40.00"},"PAGADO"]
[85,"1715852701 - ACIPUELA LAGLAGUANO ADAN PATRICIO","C. A. R. DECIAP","ENTRENADOR CLUB FILIAL",0,{"v":40,"d":"$40.00"},"PAGADO"]
[86,"1718817446 - MOGOLLON MORENO BRYAN JHOEL","C. A. R. DECIAP","ENTRENADOR CLUB FILIAL",0,{"v":40,"d":"$40.00"},"PAGADO"]
[87,"1714903851 - BAYAS CAÑAS WAGNER ANTONIO","C. A. R. DECIAP","ENTRENADOR CLUB FILIAL",0,{"v":40,"d":"$40.00"},"PAGADO"]
[88,"0550283568 - LOPEZ SILVA WENDY JANETH","C. A. R. DECIAP","ENTRENADOR CLUB FILIAL",0,{"v":40,"d":"$40.00"},"PAGADO"]
[89,"1725102451 - PABLO SEBASTIAN TAYO AGUAS","C. A. R. DECIAP","ENTRENADOR CLUB FILIAL",0,{"v":40,"d":"$40.00"},"PAGADO"]
[90,"1722665930 - TAPIA PALOMEQUE KARENT NICOLE","CLUB HAN KUM DO","DIRECTOR CLUB FILIAL",0,{"v":30,"d":"$30.00"},"PAGADO"]
[91,"1717275315 - PALMA AYALA JOSÉ  DAVID","CLUB HAN KUM DO","ENTRENADOR CLUB FILIAL",0,{"v":40,"d":"$40.00"},"PAGADO"]
[92,"1717498164 - TUQUERES SALAS PATRICIA  MARGOTH","CLUB TAE WOONG","DIRECTOR CLUB FILIAL",0,{"v":30,"d":"$30.00"},"PAGADO"]
[93,"1713952859 - TOASA LEMA EDGAR  RAMIRO","CLUB TAE WOONG","ENTRENADOR CLUB FILIAL",0,{"v":40,"d":"$40.00"},"PAGADO"]
[94,"1717054256 - TUQUERES SALAS SARA ADELA","CLUB TAE WOONG","ENTRENADOR CLUB FILIAL",0,{"v":40,"d":"$40.00"},"PAGADO"]
[95,"1712258357 - CARVAJAL NÚÑEZ RICHARD  DAVID","CLUB TAE WOONG","ENTRENADOR CLUB FILIAL",0,{"v":40,"d":"$40.00"},"PAGADO"]
[96,"1719601047 - FARIAS TORRES EDWIN LEONEL","CONDOR","MONITOR CLUB FILIAL",0,{"v":40,"d":"$40.00"},"PAGADO"]
[97,"1716982580 - TORRES BAÑO JAIME EFREN","CONDOR","ENTRENADOR CLUB FILIAL",0,{"v":40,"d":"$40.00"},"PAGADO"]
[98,"1716622632 - PÉREZ VILLAFUERTE  EDISON PATRICIO","DAIGORO","DIRECTOR CLUB FILIAL",0,{"v":30,"d":"$30.00"},"PAGADO"]
[99,"1726599077 - PÉREZ VILLAFUERTE  JAIME SEBASTIAN","DAIGORO","ENTRENADOR CLUB FILIAL",0,{"v":40,"d":"$40.00"},"PAGADO"]
[100,"1724995558 - PEREZ  VILLAFUERTE JAIRO RENE","DAIGORO","ENTRENADOR CLUB FILIAL",0,{"v":40,"d":"$40.00"},"PAGADO"]
[101,"1719567453 - BOLAÑOS  RUIZ JIMMY EDUARDO","DEBAK TKD","DIRECTOR CLUB FILIAL",0,{"v":30,"d":"$30.00"},"PAGADO"]
[102,"1751634336 - IBARRA ROBAYO JULIAN ALEXANDER","DEBAK TKD","MONITOR CLUB FILIAL",0,{"v":40,"d":"$40.00"},"PAGADO"]
[103,"3050423825 - MARCANO AFONSO IVAN ANDRES","DEBAK TKD","MONITOR CLUB FILIAL",0,{"v":40,"d":"$40.00"},"PAGADO"]
[104,"1750537050 - CELI LAGLA  ZOE ZOE","DEBAK TKD","MONITOR CLUB FILIAL",0,{"v":40,"d":"$40.00"},"PAGADO"]
[105,"1754408803 - VARGAS VERA JOAQUIN ANDRES","DEBAK TKD","MONITOR CLUB FILIAL",0,{"v":40,"d":"$40.00"},"PAGADO"]
[106,"1719567446 - BOLAÑOS RUIZ MARTHA STEPHANIE","DEBAK TKD","ENTRENADOR CLUB FILIAL",0,{"v":40,"d":"$40.00"},"PAGADO"]
[107,"1704453198 - PRADO VERDESOTO MARCELO EFREN","DEBAK TKD","ENTRENADOR CLUB FILIAL",0,{"v":40,"d":"$40.00"},"PAGADO"]
[108,"1750173724 - LLAGUNO PIARPUSAN SANTIAGO  ALEXANDER","DEBAK TKD","ENTRENADOR CLUB FILIAL",0,{"v":40,"d":"$40.00"},"PAGADO"]
[109,"1726977539 - BENAVIDES ARAUJO MARTIN JAVIER","DEBAK TKD","ENTRENADOR CLUB FILIAL",0,{"v":40,"d":"$40.00"},"PAGADO"]
[110,"1722536966 - LARA ARMENDARIZ ADRIAN NICOLAS","DEBAK TKD","ENTRENADOR CLUB FILIAL",0,{"v":40,"d":"$40.00"},"PAGADO"]
[111,"1754638086 - QUISNIA SISALEMA RODNEEY DE JESUS","DEBAK TKD","ENTRENADOR CLUB FILIAL",0,{"v":40,"d":"$40.00"},"PAGADO"]
[112,"1757926959 - FLORES  KEVIN","DEBAK TKD","ENTRENADOR CLUB FILIAL",0,{"v":40,"d":"$40.00"},"PAGADO"]
[113,"1724268212 - VARGAS VERA JARED ESTEBAN","DEBAK TKD","ENTRENADOR CLUB FILIAL",0,{"v":40,"d":"$40.00"},"PAGADO"]
[114,"1751614353 - RUIZ SAAVEDRA HECTOR GABRIEL","DEBAK TKD","ENTRENADOR CLUB FILIAL",0,{"v":40,"d":"$40.00"},"PAGADO"]
[115,"1753431244 - RIOS GUITARRA  AXEL GABRIEL","DEBAK TKD","OYENTE",0,{"v":10,"d":"$10.00"},"PAGADO"]
[116,"1707760946 - NARANJO NARANJO DIEGO RAUL","DEBAK TKD","OYENTE",0,{"v":10,"d":"$10.00"},"PAGADO"]
[117,"1706324082 - ALVEAR GRANDA SANDRA LUCÍA","DOJANG TKD MELO","ENTRENADORCLUB FILIAL",0,{"v":40,"d":"$40.00"},"PAGADO"]
[118,"1707456081 - MELO CARRERA BOLIVAR VINICIO","DOJANG TKD MELO","DIRECTOR CLUB FILIAL",0,{"v":30,"d":"$30.00"},"PAGADO"]
[119,"1716531221 - RODRÍGUEZ PISULÍ EDISON GIOVANNY","DRACO","DIRECTOR CLUB FILIAL",0,{"v":40,"d":"$40.00"},"PAGADO"]
[120,"1751441591 - PROAÑO OLAYA ETHAN JARED","DRACO","MONITOR CLUB FILIAL",0,{"v":40,"d":"$40.00"},"PAGADO"]
[121,"1720747243 - RODRÍGUEZ PISULÍ RICHARD  ALEJANDRO","DRACO","ENTRENADOR CLUB FILIAL",0,{"v":40,"d":"$40.00"},"PAGADO"]
[122,"1724986375 - VIZUETE LUNA FLAVIO ISMAEL","DRACO","ENTRENADOR CLUB FILIAL",0,{"v":40,"d":"$40.00"},"PAGADO"]
[123,"1712951472 - AGUAS LLUMIHUGSI JOSE MIGUEL","DRAGON GYM","DIRECTOR, ENTRENADOR, MONITOR DE CLUB NO FILIAL",0,{"v":30,"d":"$30.00"},"PAGADO"]
[124,"1724351646 - AGUAS MOPOSITA JOHANNA VANESSA","DRAGON GYM","ENTRENADOR CLUB FILIAL",0,0,"NO VINO"]
[125,"1709717043 - MOPOSITA PILLAJO SILVIA MARIA","DRAGON GYM","ENTRENADOR CLUB FILIAL",0,{"v":40,"d":"$40.00"},"PAGADO"]
[126,"0502381510 - LEMA  TRAVEZ  EDGAR  MARCELO","DRAGON LEE GYM","DIRECTOR CLUB FILIAL",0,{"v":30,"d":"$30.00"},"PAGADO"]
[127,"1753548054 - CAJIGAL KINDELAN EDDY JULIO","ECUADCUBA","DIRECTOR CLUB FILIAL",0,0,"POR COBRAR"]
[128,"1750102640 - GAMBOA HURTADO LUCIANA VALENTINA","ECUADCUBA","MONITOR CLUB FILIAL",0,{"v":40,"d":"$40.00"},"PAGADO"]
[129,"1726007618 - BASTIDAS  ALMACHI DANIEL LEONARDO","ECUADCUBA","MONITOR CLUB FILIAL",0,{"v":40,"d":"$40.00"},"PAGADO"]
[130,"1725212383 - LOPEZ FLORES JHONATAN EDUARDO","ECUADCUBA","ENTRENADOR CLUB FILIAL",0,{"v":40,"d":"$40.00"},"PAGADO"]
[131,"0701110348 - ASTUDILLO CHACON JORGE HUMBERTO","ECUADOR","DIRECTOR CLUB FILIAL",0,{"v":30,"d":"$30.00"},"PAGADO"]
[132,"1709065088 - PEÑALOZA GARNICA LUIS EDUARDO","ECUADOR","MONITOR CLUB FILIAL",0,{"v":40,"d":"$40.00"},"PAGADO"]
[133,"1718265729 - VALDIVIESO TULCAN EDWIN VINICIO","ECUADOR","MONITOR CLUB FILIAL",0,{"v":40,"d":"$40.00"},"PAGADO"]
[134,"1752818003 - QUIJIJE AMAGUA MARLON PATRICIO","ECUADOR","MONITOR CLUB FILIAL",0,{"v":40,"d":"$40.00"},"PAGADO"]
[135,"1712775780 - LARA PEREZ LUIS GONZALO","ECUADOR","MONITOR CLUB FILIAL",0,{"v":40,"d":"$40.00"},"PAGADO"]
[136,"1750108225 - PEÑALOZA CARRION EMILIA IVANOVA","ECUADOR","MONITOR CLUB FILIAL",0,{"v":40,"d":"$40.00"},"PAGADO"]
[137,"1724525637 - LARA TACURI LUIS SANTIAGO","ECUADOR","MONITOR CLUB FILIAL",0,{"v":40,"d":"$40.00"},"PAGADO"]
[138,"1717368656 - ASTUDILLO AREVALO JORGE LUIS","ECUADOR","ENTRENADOR CLUB FILIAL",0,{"v":40,"d":"$40.00"},"PAGADO"]
[139,"1725044471 - PLAZARTE TOPA KATHERINE ANAHI","ECUADOR","OYENTE",0,{"v":10,"d":"$10.00"},"PAGADO"]
[140,"1722962857 - ZAPATA BUSTAMANTE DAYANA MICHELLE","ECUADOR","OYENTE",0,{"v":10,"d":"$10.00"},"PAGADO"]
[141,"1706748827 - VALENCIA  POLANCO JUAN  PATRICIO","EQUILIBRIO","DIRECTOR CLUB FILIAL",0,{"v":30,"d":"$30.00"},"PAGADO"]
[142,"1725453318 - ROSERO ALBAN CHRISTIAN  MARTIN","EQUILIBRIO","MONITOR CLUB FILIAL",0,{"v":40,"d":"$40.00"},"PAGADO"]
[143,"1714669791 - VALENCIA REINOSO JUAN  CARLOS","EQUILIBRIO","ENTRENADOR CLUB FILIAL",0,{"v":40,"d":"$40.00"},"PAGADO"]
[144,"1712348901 - LOACHAMIN ALDAZ EDUARDO MARCELO","ESPE       ","DIRECTOR CLUB FILIAL",{"v":30,"d":"$30.00"},0,"PAGADO"]
[145,"1726535154 - TENORIO TIPAN NATALY YAJAIRA","ESPE","MONITOR CLUB FILIAL",{"v":40,"d":"$40.00"},0,"PAGADO"]
[146,"0402191068 - NASAMUES BOLAÑOS ANGELA LISBETH","ESPE","MONITOR CLUB FILIAL",{"v":40,"d":"$40.00"},0,"PAGADO"]
[147,"1726589441 - YANCHAPAXI QUILUMBAQUIN JOSELYN  ARACELY","ESPE","MONITOR CLUB FILIAL",{"v":40,"d":"$40.00"},0,"PAGADO"]
[148,"1724488083 - TIPAN CHILUISA MELISSA JOANA","ESPE","MONITOR CLUB FILIAL",{"v":40,"d":"$40.00"},0,"PAGADO"]
[149,"1720535564 - PILLAJO PERALTA MIGUEL ANDRES","ESPE","ENTRENADOR CLUB FILIAL",{"v":40,"d":"$40.00"},0,"PAGADO"]
[150,"1715615751 - GUAMBI MONTA HENRY JONATHAN","ESPE","ENTRENADOR CLUB FILIAL",{"v":40,"d":"$40.00"},0,"PAGADO"]
[151,"1725854184 - ARRIETA MUQUINCHE JONATHAN STEVEN","ESPE","ENTRENADOR CLUB FILIAL",{"v":40,"d":"$40.00"},0,"PAGADO"]
[152,"1727067264 - CASTAÑEDA SAENZ KATHERINE ALEJANDRA","ESPE","OYENTE",{"v":10,"d":"$10.00"},0,"PAGADO"]
[153,"1725517112 - RIERA RAMOS ANDRES SEBASTIAN","ESPE","OYENTE",{"v":10,"d":"$10.00"},0,"PAGADO"]
[154,"1715861652 - ROJAS PORTERO JOSUE MESIAS","FARANG","DIRECTOR CLUB FILIAL",{"v":30,"d":"$30.00"},0,"PAGADO"]
[155,"1727139766 - CALVA JUMA NICOLE ALEJANDRA","FEDEPDAL","DIRECTOR, ENTRENADOR, MONITOR DE CLUB NO FILIAL",0,{"v":40,"d":"$40.00"},"PAGADO"]
[156,"1718340431 - TUQUERES SUNTAXI JOHNATTAN ALEXANDER","FEDEPDAL","DIRECTOR, ENTRENADOR, MONITOR DE CLUB NO FILIAL",0,{"v":40,"d":"$40.00"},"PAGADO"]
[157,"1727668965 - LASCANO VELASCO JERAI NICOLAI","FIRST CLASS CALDERÓN","MONITOR CLUB FILIAL",0,{"v":40,"d":"$40.00"},"PAGADO"]
[158,"1766400999 - PAREJA PISCO MATEO JOSUE","FIRST CLASS CALDERÓN","MONITOR CLUB FILIAL",0,{"v":40,"d":"$40.00"},"PAGADO"]
[159,"1719896118 - ALVAREZ BAUTISTA DAVID HENRY","FIRST CLASS CALDERÓN","ENTRENADOR CLUB FILIAL",0,{"v":40,"d":"$40.00"},"PAGADO"]
[160,"1724616337 - BAEZ  GÓMEZ  LENIN  STEVEN","FITT KWONDO MEJIA","ENTRENADOR CLUB FILIAL",0,{"v":40,"d":"$40.00"},"PAGADO"," "]
[161,"1713738183 - BEHR CHIRIBOGA  ERIKA  MARIA","FITT KWONDO MEJIA","OYENTE",0,{"v":10,"d":"$10.00"},"PAGADO"]
[162,"1712138757 - CAIZA  OÑA FRANKLIN EDISON","FURIA NEGRA","DIRECTOR CLUB FILIAL",0,{"v":30,"d":"$30.00"},"PAGADO"]
[163,"1719866061 - PERDOMO FACTOS CRISTIAN DANIEL","FURIA NEGRA","ENTRENADOR CLUB FILIAL",0,{"v":40,"d":"$40.00"},"PAGADO"]
[164,"1728576719 - CAIZA  CUEVA ESLENDY  ALINA","FURIA NEGRA","ENTRENADOR CLUB FILIAL",0,{"v":40,"d":"$40.00"},"PAGADO"]
[165,"0604215491 - GUERRERO  BAÑO  JAIRO  ANDRES","GUERREROS SPORT","DIRECTOR, ENTRENADOR, MONITOR DE CLUB NO FILIAL",0,0,"NO VINO"]
[166,"1708262520 - VALLADARES VÁSQUEZ GALO MAURICIO","HANSU CAYAMBE","DIRECTOR CLUB FILIAL",{"v":30,"d":"$30.00"},0,"PAGADO"]
[167,"1713676201 - VILLAMARIN CHIMARRO PABLO GUSTAVO","HANSU CAYAMBE","MONITOR CLUB FILIAL",{"v":40,"d":"$40.00"},0,"PAGADO"]
[168,"1754445904 - MINANGO MINANGO CORALY CORALY","HANSU CAYAMBE","MONITOR CLUB FILIAL",{"v":40,"d":"$40.00"},0,"PAGADO"]
[169,"0650316680 - LEMA ANDRADE FRANCISCO ANDRES","HANSU CAYAMBE","MONITOR CLUB FILIAL",{"v":40,"d":"$40.00"},0,"PAGADO"]
[170,"1754996351 - CELI  VILCACUNDO JUAN  JOSE","HANSU CAYAMBE","MONITOR CLUB FILIAL",{"v":40,"d":"$40.00"},0,"PAGADO"]
[171,"1751089515 - VALLADARES GUATEMAL  DAVID ALEJANDRO","HANSU CAYAMBE","MONITOR CLUB FILIAL",{"v":40,"d":"$40.00"},0,"PAGADO"]
[172,"1728018795 - ULCUANGO QUISHPE EMERSON ISAAC","HANSU CAYAMBE","MONITOR CLUB FILIAL",{"v":40,"d":"$40.00"},0,"PAGADO"]
[173,"1728212000 - ABRIGO BONE GERSON ROBERTO","HANSU CAYAMBE","MONITOR CLUB FILIAL",{"v":40,"d":"$40.00"},0,"PAGADO"]
[174,"1755856935 - REINOSO AGUILAR LADY ALEJANDRA","HANSU CAYAMBE","MONITOR CLUB FILIAL",{"v":40,"d":"$40.00"},0,"PAGADO"]
[175,"1716221039 - VALLADARES ESPINOSA SHEILA GEOVANNA","HANSU CAYAMBE","ENTRENADOR CLUB FILIAL",{"v":40,"d":"$40.00"},0,"PAGADO"]
[176,"1753424454 - CORREA HERMOSA CHRISTOPHER  DAVID","HANSU CAYAMBE","ENTRENADOR CLUB FILIAL",{"v":40,"d":"$40.00"},0,"PAGADO"]
[177,"1724676539 - VALLADARES ESPINOSA MARIA AUGUSTA","HANSU CAYAMBE","ENTRENADOR CLUB FILIAL",{"v":40,"d":"$40.00"},0,"PAGADO"]
[178,"1003142724 - REYES CHICAIZA FERNANDO HELEODORO","HANSU CAYAMBE","ENTRENADOR CLUB FILIAL",{"v":40,"d":"$40.00"},0,"PAGADO"]
[179,"1725791840 - HIDALGO  SAAVEDRA STIVEN  RAUL","HIMCHARI DOJANG","MONITOR CLUB FILIAL",0,{"v":40,"d":"$40.00"},"PAGADO"]
[180,"1725042152 - GARZON SOSA ANDREA  ISABEL","HIMCHARI DOJANG","ENTRENADOR CLUB FILIAL",0,{"v":40,"d":"$40.00"},"PAGADO"]
[181,"1726690348 - CALVOPIÑA TELLO MARIA GABRIELA","HUANG TOP GYM","MONITOR CLUB FILIAL",0,{"v":40,"d":"$40.00"},"PAGADO"]
[182,"1709170870 - MEDINA . CHRISTIAN .","HUANG TOP GYM","MONITOR CLUB FILIAL",0,{"v":40,"d":"$40.00"},"PAGADO"]
[183,"1711277093 - MEJIA CORDOVA GUIDO MARIN","HUANG TOP GYM","DIRECTOR, ENTRENADOR, MONITOR DE CLUB NO FILIAL",0,{"v":30,"d":"$30.00"},"PAGADO"]
[184,"0604022038 - PARRA YANCHAPAXI MIGUEL  ANGUEL","ILYO M.P","DIRECTOR CLUB FILIAL",0,{"v":30,"d":"$30.00"},"PAGADO"]
[185,"1754335907 - CAISAGUANO  VARGAS DANIEL HUMBERTO","ILYO M.P","MONITOR CLUB FILIAL",0,{"v":40,"d":"$40.00"},"PAGADO"]
[186,"1754133948 - PARRA ZAPATA MATEO DANIEL","ILYO M.P","MONITOR CLUB FILIAL",0,{"v":40,"d":"$40.00"},"PAGADO"]
[187,"1750925941 - BARBA RODRIGUEZ ALISSON NIKOL","ILYO M.P","MONITOR CLUB FILIAL",0,{"v":40,"d":"$40.00"},"PAGADO"]
[188,"1726731639 - PARRA ZAPATA DANIELA MICAELA","ILYO M.P","ENTRENADOR CLUB FILIAL",0,{"v":40,"d":"$40.00"},"PAGADO"]
[189,"1717464570 - ALOMOTO CUVI ISAAC SALOMON","ISCTKD","DIRECTOR CLUB NOFILIAL",0,{"v":30,"d":"$30.00"},"PAGADO"]
[190,"1718817438 - MOGOLLÓN  MORENO LESSLY  SAMANTHA","JERATHEL","DIRECTOR CLUB FILIAL",0,{"v":30,"d":"$30.00"},"PAGADO"]
[191,"1755986823 - GARZÓN  PULLUPAXI  ESTEBAN JOEL","JERATHEL","ENTRENADOR CLUB FILIAL",0,{"v":40,"d":"$40.00"},"PAGADO"]
[192,"1721813291 - VALENCIA  MEDRANDA  JONNATHAN  ANDRÉS","JERATHEL","ENTRENADOR CLUB FILIAL",0,{"v":40,"d":"$40.00"},"PAGADO"]
[193,"1723486179 - MOGOLLÓN MORENO GLYNKA YARICELL","JERATHEL","ENTRENADOR CLUB FILIAL",0,{"v":40,"d":"$40.00"},"PAGADO"]
[194,"1752158103 - ROMERO  GARCÍA  KEVIN JULIAN","JERATHEL","ENTRENADOR CLUB FILIAL",0,{"v":40,"d":"$40.00"},"PAGADO"]
[195,"1712828738 - DELCASTILLO MURGUEITIO DAVID .","JIDOKWAN DC","DIRECTOR CLUB FILIAL",{"v":30,"d":"$30.00"},0,"PAGADO"]
[196,"0401586615 - NARVAEZ REINA JOSE DAVID","JOSEON LEGACY","MONITOR CLUB FILIAL",0,{"v":40,"d":"$40.00"},"PAGADO"]
[197,"1719515676 - CUJILEMA  YAUCAN LUIS  GEOVANY","JOSEON LEGACY","ENTRENADOR CLUB FILIAL",0,{"v":40,"d":"$40.00"},"PAGADO"]
[198,"1718423450 - VIANA TIMBIANO VLADIMIR FERNANDO","JOSEON LEGACY","ENTRENADOR CLUB FILIAL",0,{"v":40,"d":"$40.00"},"PAGADO"]
[200,"1004106645 - TROYA JIMENEZ MARIO ALEJANDRO","JR SPORT","MONITOR CLUB FILIAL",0,0,"DESCUENTO"]
[201,"1712324928 - PAVÓN FLORES JHONNY FRANKLIN","JUVENTUS","DIRECTOR CLUB FILIAL",0,{"v":30,"d":"$30.00"},"PAGADO"]
[203,"1708640097 - HERRERA SIMBAÑA MIRIAN ALEXANDRA","JUVENTUS","MONITOR CLUB FILIAL",0,{"v":10,"d":"$10.00"},"PAGADO"]
[204,"1719363036 - PAVON FLORES MIGUEL ANGEL","KO AMERICA","DIRECTOR CLUB FILIAL",0,0,"EXONERADO"]
[205,"1752535789 - CHALCUALAN RAMOS KEVIN OSWALDO","KO AMERICA","MONITOR CLUB FILIAL",0,{"v":40,"d":"$40.00"},"PAGADO"]
[206,"1752707198 - VALDIVIEZO REYES MATHEO EMILIO","KO AMERICA","MONITOR CLUB FILIAL",{"v":40,"d":"$40.00"},0,"PAGADO"]
[207,"1721512703 - CHALCUALAN RAMOS BRYAN ANDRES","KO AMERICA","ENTRENADOR CLUB FILIAL",0,{"v":40,"d":"$40.00"},"PAGADO"]
[208,"1750406538 - SALDAÑA MENESES ERICK RAPHAEL","KO AMERICA","ENTRENADOR CLUB FILIAL",0,{"v":40,"d":"$40.00"},"PAGADO"]
[209,"1713568796 - SANDOVAL GITALA LUIS  GONZALO","KO AMERICA","ENTRENADOR CLUB FILIAL",0,{"v":40,"d":"$40.00"},"PAGADO"]
[210,"1709697757 - MORENO  PROAÑO  FABIÁN  EDUARDO","KOREAN DRAGON","DIRECTOR CLUB FILIAL",0,{"v":30,"d":"$30.00"},"PAGADO"]
[211,"133573477 - MOLINA RODRIGUEZ ALEXANDER ADRIAN","KOREAN DRAGON","MONITOR CLUB FILIAL",0,{"v":40,"d":"$40.00"},"PAGADO"]
[212,"1754760666 -  GUAÑA  CASTILLO ESTEFANNY  GABRIELA","KOREAN DRAGON","MONITOR CLUB FILIAL",0,{"v":40,"d":"$40.00"},"PAGADO"]
[213,"1754023313 - SANTOS MONTESDEOCA  CARLA EMILIA","KOREAN DRAGON","MONITOR CLUB FILIAL",0,{"v":40,"d":"$40.00"},"PAGADO"]
[214,"1753335023 - PEREZ ESPINOZA PAULA VICTORIA","KOREAN DRAGON","MONITOR CLUB FILIAL",0,{"v":40,"d":"$40.00"},"PAGADO"]
[215,"1752047637 - CORREA ALDAZ DANNA AYELEN","KOREAN DRAGON","MONITOR CLUB FILIAL",0,{"v":40,"d":"$40.00"},"PAGADO"]
[216,"1725565632 - MATUTE BURGOS ANDRÉS  ANTONIO","KOREAN DRAGON","ENTRENADOR CLUB FILIAL",0,{"v":40,"d":"$40.00"},"PAGADO"]
[217,"1711772374 - CAMPBELL C JUAN CARLOS","KOREAN DRAGON","ENTRENADOR CLUB FILIAL",0,{"v":40,"d":"$40.00"},"PAGADO"]
[218,"1103657142 - AVILÉZ RAMOS OMAR ANTONIO","KOREAN DRAGON","ENTRENADOR CLUB FILIAL",0,{"v":40,"d":"$40.00"},"PAGADO"]
[219,"1754254892 - AULLA OLIVAREZ JOSUE ISRAEL","KOREAN DRAGON","ENTRENADOR CLUB FILIAL",0,{"v":40,"d":"$40.00"},"PAGADO"]
[220,"1754254926 - AULLA OLIVAREZ JOEL ALBERTO","KOREAN DRAGON","ENTRENADOR CLUB FILIAL",0,{"v":40,"d":"$40.00"},"PAGADO"]
[221,"1722140041 - FOLLECO MINA DAYANA PATRICIA","KORYO","ENTRENADOR CLUB FILIAL",0,{"v":40,"d":"$40.00"},"PAGADO"]
[222,"1711497923 - PUGA BURGASI GUILLERMO LEONIDAS","KORYO","DIRECTOR CLUB FILIAL",0,{"v":30,"d":"$30.00"},"PAGADO"]
[223,"1720243300 - LOPEZ PUGA SHARON ELIZABETH","KORYO","ENTRENADOR CLUB FILIAL",0,{"v":40,"d":"$40.00"},"PAGADO"]
[224,"1751462134 - COPO PUSDA EMILY KIMBERLY","KORYO","MONITOR CLUB FILIAL",0,{"v":40,"d":"$40.00"},"PAGADO"]
[225,"1150011524 - TAPIA ROJAS IKER SEBASTIÁN","KORYO","MONITOR CLUB FILIAL",0,{"v":40,"d":"$40.00"},"PAGADO"]
[226,"1720195096 - VITERI ARCE MARCO ANTONIO","KORYO","ENTRENADOR CLUB FILIAL",0,{"v":40,"d":"$40.00"},"PAGADO"]
[227,"1727315648 - CHICAIZA  CHUQUITARCO  DAVID ALEXANDER","KUKKIWON","DIRECTOR CLUB FILIAL",0,{"v":30,"d":"$30.00"},"PAGADO"]
[228,"1712548203 - CHICAIZA MORENO JOSÉ FRANCISCO","KUKKIWON","ENTRENADOR CLUB FILIAL",0,{"v":40,"d":"$40.00"},"PAGADO"]
[229,"1752588846 - CHICAIZA CHUQUITARCO CRISTIAN ISRAEL","KUKKIWON","ENTRENADOR CLUB FILIAL",0,{"v":40,"d":"$40.00"},"PAGADO"]
[230,"1718253022 - GARCÍA  BENITEZ JOSÉ  FABIÁN","KUMGANG DUL","DIRECTOR CLUB FILIAL",0,{"v":30,"d":"$30.00"},"PAGADO"]
[231,"1751282276 - LLIVE  TAPIA  MAURICIO  SEBASTIAN","KUMGANG DUL","MONITOR CLUB FILIAL",{"v":20,"d":"$20.00"},{"v":20,"d":"$20.00"},"PAGADO"]
[232,"1724259302 - ORTIZ BARROS ALISSON MICHELLE","KUMGANG DUL","MONITOR CLUB FILIAL",0,{"v":40,"d":"$40.00"},"PAGADO"]
[233,"1729005064 - BARROS BARROS ANGELINA JULIETH","KUMGANG DUL","MONITOR CLUB FILIAL",0,{"v":40,"d":"$40.00"},"PAGADO"]
[234,"1754500484 - NUÑEZ  GARCIA  LEILA  MAYERLI","KUMGANG DUL","MONITOR CLUB FILIAL",{"v":40,"d":"$40.00"},0,"PAGADO"]
[235,"1718023227 - BARROS BOHÓRQUEZ  JENNY  CRISTINA","KUMGANG DUL","ENTRENADOR CLUB FILIAL",0,{"v":40,"d":"$40.00"},"PAGADO"]
[236,"1709221137 - CARDONA SALAZAR AMILCAR VINICIO","KYORUGUI GYM","DIRECTOR CLUB FILIAL",0,{"v":30,"d":"$30.00"},"PAGADO"]
[237,"1753064656 - CALIXTO BURGOS JOSTYN MATEO","KYORUGUI GYM","MONITOR CLUB FILIAL",0,{"v":40,"d":"$40.00"},"PAGADO"]
[238,"1717275703 - ANGUIZACA TABANGO CARLOS VLADIMIR","KYORUGUI GYM","MONITOR CLUB FILIAL",0,{"v":40,"d":"$40.00"},"PAGADO"]
[239,"1707513139 - CACHAGO COLLAGUAZO JOSE ARMANDO","KYORUGUI GYM","ENTRENADOR CLUB FILIAL",0,{"v":40,"d":"$40.00"},"PAGADO"]
[240,"1719242214 - ALDAS CORTEZ JOSUE ALEJANDRO","KYORUGUI GYM","ENTRENADOR CLUB FILIAL",0,{"v":45,"d":"$45.00"},"PAGADO"]
[241,"1753106200 - CASTILLO  MONTATIXE  ZULAY  ALEJANDRA","LDCM","MONITOR CLUB FILIAL",0,{"v":40,"d":"$40.00"},"PAGADO"]
[242,"1727870386 - JACOME  CAMACHO  EYLIN  CAMILA","LDCM","MONITOR CLUB FILIAL",0,{"v":40,"d":"$40.00"},"PAGADO"]
[243,"1724040124 - QUICALIQUIN  RODRIGUEZ  JEFFERSON  ESTALIN","LDCM","ENTRENADOR CLUB FILIAL",0,{"v":40,"d":"$40.00"},"PAGADO"]
[244,"1722799705 - TOAPANTA  CALAPIÑA  JORGE  EDUARDO","LDCM","ENTRENADOR CLUB FILIAL",0,{"v":40,"d":"$40.00"},"PAGADO"]
[245,"1708549009 - PILAQUINGA  QUIMBIULCO  ROMEL ALVEIRO","LEON","DIRECTOR CLUB FILIAL",0,{"v":30,"d":"$30.00"},"PAGADO"]
[246,"1714141916 - LUNA ARELLANO JENNY  JANINA","LEON","ENTRENADOR CLUB FILIAL",0,{"v":40,"d":"$40.00"},"PAGADO"]
[247,"1722884713 - FLORES GUANULEMA CHRISTIAN ERNESTO","LOBOS","DIRECTOR CLUB FILIAL",{"v":30,"d":"$30.00"},0,"PAGADO"]
[248,"1712857356 - GAVILANEZ  PACHACAMA GALO  OSWALDO","LOS PUMAS","DIRECTOR CLUB FILIAL",0,{"v":30,"d":"$30.00"},"PAGADO"]
[249,"1753779519  - CRUZ  LLUMIQUINGA ANTHONY EDUARDO","LOS PUMAS","MONITOR CLUB FILIAL",0,{"v":40,"d":"$40.00"},"PAGADO"]
[250,"1727689414 - SUNTAXI CHANATAXI CHRISTOFER ARIEL","LOS PUMAS","MONITOR CLUB FILIAL",0,{"v":40,"d":"$40.00"},"PAGADO"]
[251,"1753779824  - CRUZ LLUMIQUINGA BELEN  ALEXANDRA","LOS PUMAS","MONITOR CLUB FILIAL",0,{"v":40,"d":"$40.00"},"PAGADO"]
[252,"1751697101 - MEDINA  FONSECA NAYDELIN KAROLINA","LOS PUMAS","MONITOR CLUB FILIAL",0,{"v":40,"d":"$40.00"},"PAGADO"]
[253,"132515687 - LINARES PULIDO DIEGO  ALEJANDRO","LOS PUMAS","MONITOR CLUB FILIAL",0,{"v":40,"d":"$40.00"},"PAGADO"]
[254,"1725594749 - ANDRANGO SUNTAXI CARLOS MATEO","LOS PUMAS","MONITOR CLUB FILIAL",0,{"v":40,"d":"$40.00"},"PAGADO"]
[255,"1724216849 - SUNTAXI CALVACHE MELANY ALEJANDRA","LOS PUMAS","MONITOR CLUB FILIAL",0,{"v":40,"d":"$40.00"},"PAGADO"]
[256,"1716199904 - SUNTAXI  GUALOTUÑA LORENA  LUZ","LOS PUMAS","ENTRENADOR CLUB FILIAL",0,{"v":40,"d":"$40.00"},"PAGADO"]
[257,"1727363986 - GAVILANEZ  PAUCAR  JOE ALEXANDER","LOS PUMAS","ENTRENADOR CLUB FILIAL",0,{"v":40,"d":"$40.00"},"PAGADO"]
[258,"1709499402 - GRANDA CASTELLANOS HECTOR BOLIVAR","MARCIAL CLUB GRANDA","ENTRENADOR CLUB FILIAL",0,{"v":45,"d":"$45.00"},"PAGADO"]
[259,"1717469462 - ENRIQUEZ GRANDA BRYAN XAVIER","MARCIAL CLUB GRANDA","ENTRENADOR CLUB FILIAL",0,{"v":45,"d":"$45.00"},"PAGADO"]
[260,"1709499618 - GRANDA CASTELLANOS LUIS CARLOS","MARCIAL CLUB GRANDA","DIRECTOR CLUB FILIAL",0,{"v":30,"d":"$30.00"},"PAGADO"]
[261,"1713282356 - PAREDES RAMIREZ LILIAN CRISTINA","MARCIAL CLUB GRANDA","MONITOR CLUB FILIAL",0,{"v":40,"d":"$40.00"},"PAGADO"]
[262,"1001457579 - VIRACOCHA VALVERDE JORGE ANIBAL","MARCIAL CLUB GRANDA","MONITOR CLUB FILIAL",0,{"v":40,"d":"$40.00"},"PAGADO"]
[263,"1803724598 - SANCHEZ MICHAY WELLINGTON PAUL","MICHAYDO","DIRECTOR CLUB FILIAL",0,{"v":30,"d":"$30.00"},"PAGADO"]
[264,"1719752782 - GUERRA BARAHONA DANIEL SEBASTIAN","MIKIDO","DIRECTOR CLUB FILIAL",0,{"v":30,"d":"$30.00"},"PAGADO"]
[265,"1713380051 - GALORA VACA JEAN WALMORE","MILLENIUM","DIRECTOR CLUB FILIAL",0,{"v":30,"d":"$30.00"},"PAGADO"]
[266,"1712034527 - DUCHI . MARCO .","MINOTAUROS ECU","DIRECTOR CLUB FILIAL",0,{"v":30,"d":"$30.00"},"PAGADO"]
[267,"1725288946 - SALAS MADRID DANIEL ALEJANDRO","MINOTAUROS ECU","ENTRENADOR CLUB FILIAL",0,{"v":40,"d":"$40.00"},"PAGADO"]
[268,"1106026378 - GAONA PINTADO JENNY MARISOL","MINOTAUROS ECU","OYENTE",0,{"v":10,"d":"$10.00"},"PAGADO"]
[269,"1723505853 - ROSERO MORALES CRISTHIAN  ANDRES","MINOTAUROS ECU","OYENTE",0,{"v":10,"d":"$10.00"},"PAGADO"]
[270,"1728231331 - DAVILA  AGUILERA  LUCIANA SARAHI","MOODUKKWAN TTC ","MONITOR CLUB FILIAL",0,{"v":40,"d":"$40.00"},"PAGADO"]
[271,"1727540021 - VALLE PEREZ AMANDA RAFAELA","MOODUKKWAN TTC ","MONITOR CLUB FILIAL",0,{"v":40,"d":"$40.00"},"PAGADO"]
[272,"1712518925 - MALDONADO JIJON JOSE LUIS","MOODUKKWAN TKDTRAINING CENTER","MONITOR CLUB FILIAL",0,{"v":40,"d":"$40.00"},"PAGADO"]
[273,"0750277733 - ALBURQUEQUE  MERIZALDE MILEY CAMILA","MOODUKKWAN TTC ","MONITOR CLUB FILIAL",0,{"v":40,"d":"$40.00"},"PAGADO"]
[274,"1715351431 - SALAZAR SUAREZ FRANCK IVAN","MOODUKKWAN TTC ","MONITOR CLUB FILIAL",0,{"v":40,"d":"$40.00"},"PAGADO"]
[275,"1754455929 - CEVALLOS SORNOZA MAITE JUSETH","MOODUKKWAN TTC ","MONITOR CLUB FILIAL",0,{"v":40,"d":"$40.00"},"PAGADO"]
[276,"1715386270 - VALLEJO VILLACRES ANDREA ANDREA","MOODUKKWAN TTC ","ENTRENADOR CLUB FILIAL",0,{"v":40,"d":"$40.00"},"PAGADO"]
[277,"1727737338 - ALQUINGA BEDOYA JONATHAN  ANDRES","MOODUKKWAN TTC ","ENTRENADOR CLUB FILIAL",0,{"v":40,"d":"$40.00"},"PAGADO"]
[278,"1801914795 - MERINO CADENA DIEGO ARMANDO","MOODUKKWAN TTC ","ENTRENADOR CLUB FILIAL",0,{"v":40,"d":"$40.00"},"PAGADO"]
[279,"1716453400 - HUATO PACHECO JORGE GONZALO","MOODUKKWAN TTC ","ENTRENADOR CLUB FILIAL",0,{"v":40,"d":"$40.00"},"PAGADO"]
[280,"1801914795 - MERINO CADENA DIEGO ARMANDO","MOODUKKWAN TKDTRAINING CENTER","ENTRENADOR CLUB FILIAL",0,{"v":40,"d":"$40.00"},"PAGADO"]
[281,"1750107763 - CASTILLO RUIZ GABRIELA  ANAHÍ","MOODUKKWAN TTC ","ENTRENADOR CLUB FILIAL",0,{"v":40,"d":"$40.00"},"PAGADO"]
[282,"1714818760 - PROAÑO BOLAÑOS CAROLINA DEL CARMEN","MOODUKKWAN TTC ","ENTRENADOR CLUB FILIAL",0,{"v":40,"d":"$40.00"},"PAGADO"]
[283,"1709267338 - LOPEZ CARRERA RICARDO ARMANDO","MOODUKKWAN TTC ","ENTRENADOR CLUB FILIAL",0,{"v":40,"d":"$40.00"},"PAGADO"]
[284,"1726851361 - LOPEZ MOLINA BRYAN DANIEL","MOODUKKWAN TTC ","ENTRENADOR CLUB FILIAL",0,{"v":40,"d":"$40.00"},"PAGADO"]
[285,"2300539216 - JAYA GUTIERREZ AMIEL AMIRAN","MOODUKKWAN TTC ","ENTRENADOR CLUB FILIAL",0,{"v":40,"d":"$40.00"},"PAGADO"]
[286,"1719463307 - SIGCHOS COLUMBA HENRY DANILO","MOODUKKWAN TTC ","ENTRENADOR CLUB FILIAL",0,{"v":40,"d":"$40.00"},"PAGADO"]
[287,"1708527757 - TAYO DUQUE CESAR CRISTOBAL","MSA GRAND MASTER","DIRECTOR CLUB FILIAL",0,{"v":30,"d":"$30.00"},"PAGADO"]
[288,"1712569704 - PALADINES TOBAR JEANN OSWALDO","PALADINS MARCIAL","DIRECTOR CLUB FILIAL",0,{"v":30,"d":"$30.00"},"PAGADO "]
[289,"1755971254 - JAYA LECHON JHONATAN  ALEXANDER","PALADINS MARCIAL","MONITOR CLUB FILIAL",0,{"v":40,"d":"$40.00"},"PAGADO"]
[290,"1750506097 - MORENO CEVALLOS MYCKEL MATEO","PALADINS MARCIAL","ENTRENADOR CLUB FILIAL",0,{"v":40,"d":"$40.00"},"PAGADO"]
[291,"1750506097 - MORENO CEVALLOS MYCKEL MATEO","PALADINS MARCIAL","ENTRENADOR CLUB FILIAL",0,{"v":40,"d":"$40.00"},"PAGADO"]
[292,"1728797554 - VASQUEZ PALADINES JOHAN  J","PALADINS MARCIAL","ENTRENADOR CLUB FILIAL",0,{"v":40,"d":"$40.00"},"PAGADO"]
[293,"1709079493 - HERRERA LARREA ANDRES EFRAIN","PANDADEMON","DIRECTOR CLUB FILIAL",{"v":30,"d":"$30.00"},0,"PAGADO"]
[294,"1750484675 - PIEDRA  RAMÍREZ VICTORIA  P","PANDADEMON","MONITOR CLUB FILIAL",{"v":40,"d":"$40.00"},0,"PAGADO"]
[295,"1105990012 - MARTÍNEZ  BASTIDAS FRANCO  EMMANUEL","PANDADEMON","MONITOR CLUB FILIAL",0,{"v":40,"d":"$40.00"},"PAGADO"]
[296,"1752726511 - VINUEZA LUNA SEBASTIAN -","PANDADEMON","MONITOR CLUB FILIAL",0,{"v":40,"d":"$40.00"},"PAGADO"]
[297,"1751666262 - CORREA PALOMINO SALOME -","PANDADEMON","MONITOR CLUB FILIAL",0,{"v":40,"d":"$40.00"},"PAGADO"]
[298,"1728299296 - GUERRERO  DURANGO ISABEL  MARÍA","PANDADEMON","MONITOR CLUB FILIAL",0,{"v":40,"d":"$40.00"},"PAGADO"]
[299,"0928582931 - HERRERA YEPEZ LUIS ANDRES","PANDADEMON","ENTRENADOR CLUB FILIAL",0,{"v":40,"d":"$40.00"},"PAGADO"]
[300,"1310056161 - MOREIRA FORTIS XAVIER  ALEXANDER","PIONERO FORTIS","DIRECTOR CLUB FILIAL",0,{"v":30,"d":"$30.00"},"PAGADO"]
[301,"1723644538 - VEGA LEON LUISA BEATRIZ","PYONGYANG","DIRECTOR CLUB FILIAL",0,{"v":30,"d":"$30.00"},"PAGADO"]
[302,"1718847674 - SIGCHOS VERDESOTO HUGO FERNANDO","PYONGYANG","MONITOR CLUB FILIAL",0,{"v":40,"d":"$40.00"},"PAGADO"]
[303,"1729199032    - SIGCHOS DELGADO MATEO WOLFGANG","PYONGYANG","MONITOR CLUB FILIAL",0,{"v":40,"d":"$40.00"},"PAGADO"]
[304,"1717187221 - SIGCHOS  VERDESOTO  WILSON GERMAN","PYONGYANG","MONITOR CLUB FILIAL",0,{"v":40,"d":"$40.00"},"PAGADO"]
[305,"1752308419 - AGUIRRE TELLO ERICK SAÚL","PYONGYANG","MONITOR CLUB FILIAL",0,{"v":40,"d":"$40.00"},"PAGADO"]
[306,"1727553149 - CARRERA MORALES NICOLE DOMENICA","RAIG DE LLUM","DIRECTOR CLUB FILIAL",0,{"v":30,"d":"$30.00"},"PAGADO"]
[307,"1725658049 - REINOSO   ALEJANDRO","RAIG DE LLUM","MONITOR CLUB FILIAL",0,{"v":40,"d":"$40.00"},"PAGADO"]
[308,"1754446928 - CALDERON ROMAN HIBETH ALEXA","RAIG DE LLUM","ENTRENADOR CLUB FILIAL",0,{"v":40,"d":"$40.00"},"PAGADO"]
[309,"1750076695 - FLORES TROYA NELVIN JAHIR","RAIG DE LLUM","ENTRENADOR CLUB FILIAL",0,{"v":40,"d":"$40.00"},"PAGADO"]
[310,"1729010882 - BURBANO GUZMAN DIANA ANDREA","RAIG DE LLUM","ENTRENADOR CLUB FILIAL",0,{"v":40,"d":"$40.00"},"PAGADO"]
[311,"1714170170 - ESTRELLA CAJAS CARLOS JULIO","RED ACADEMY","DIRECTOR CLUB FILIAL",0,{"v":30,"d":"$30.00"},"PAGADO"]
[312,"1707795058 - RAMOS . MILTON .","RENACER","DIRECTOR CLUB FILIAL",{"v":30,"d":"$30.00"},0,"PAGADO"]
[313,"1715373047 - ROJAS CATOTA JORGE WASHINGOTN","ROJAS IAN IRON FIST","DIRECTOR CLUB FILIAL",{"v":30,"d":"$30.00"},0,"PAGADO"]
[314,"1708446594 - MEJIA . CARLOS LEODAN","SAN FRANCISCO TIGRES","DIRECTOR CLUB FILIAL",{"v":40,"d":"$40.00"},0,"PAGADO"]
[315,"1750988873 - EMILIO JHOEL GALLARDO BANEGAS","SAN FRANCISCO TIGRES","MONITOR CLUB FILIAL",{"v":40,"d":"$40.00"},0,"PAGADO"]
[316,"1752429470 - BEDOYA SANDOVAL NARCISA BETSABE","SAN FRANCISCO TIGRES","MONITOR CLUB FILIAL",{"v":40,"d":"$40.00"},0,"PAGADO"]
[317,"1710533660 - VIVAS BARRERA HECTOR HERNAN","SAN FRANCISCO TIGRES","ENTRENADOR CLUB FILIAL",{"v":40,"d":"$40.00"},0,"PAGADO"]
[318,"1707722904 - TIPAN IZA RAUL .","SAN SEBASTIAN","DIRECTOR CLUB FILIAL",0,{"v":30,"d":"$30.00"},"PAGADO"]
[319,"1752111961 - COLUMBA CRIOLLO ANDY FABRICIO","SAN SEBASTIAN","ENTRENADOR CLUB FILIAL",0,{"v":40,"d":"$40.00"},"PAGADO"]
[320,"1708601909 - TIPAN  IZA  LUIS  RODRIGO","SAN SEBASTIAN","ENTRENADOR CLUB FILIAL",0,{"v":40,"d":"$40.00"},"PAGADO"]
[321,"1721396024 - FLORES  VIERA DARIO FRANCISCO","SCORPIUS","DIRECTOR CLUB FILIAL",0,{"v":30,"d":"$30.00"},"PAGADO"]
[322,"1715337539 - CASTILLO CHICO FREDDY PATRICIO","SEUL","ENTRENADORCLUB FILIAL",0,{"v":40,"d":"$40.00"},"PAGADO"]
[323,"1712405800 - GARZON IBARRA GALO PATRICIO","SEUL","DIRECTOR CLUB FILIAL",0,{"v":30,"d":"$30.00"},"PAGADO"]
[324,"1725373789 - TORRES COLLAGUAZO ESTEBAN  MATEO","SEUL","MONITOR CLUB FILIAL",0,{"v":40,"d":"$40.00"},"PAGADO"]
[325,"1720726676 - TOAPANTA CATUCUAMBA MYRIAM MARLENE","SEUL","MONITOR CLUB FILIAL",0,{"v":40,"d":"$40.00"},"PAGADO"]
[326,"1750587444 - MOSQUERA  TAIPE DARIEL ANAHI","SEUL","MONITOR CLUB FILIAL",0,{"v":40,"d":"$40.00"},"PAGADO"]
[327,"1804211181 - QUILLIGANA CHUGCHO LUIS DARIO","SEUL","MONITOR CLUB FILIAL",0,{"v":40,"d":"$40.00"},"PAGADO"]
[328,"1722735998 - ARAUZ CASTRO JOSE LUIS","SEUL","MONITOR CLUB FILIAL",0,{"v":40,"d":"$40.00"},"PAGADO"]
[329,"1715731582 - PALACIOS  HERRERA  JOSÉ  LUIS","SEUL","ENTRENADOR CLUB FILIAL",0,{"v":40,"d":"$40.00"},"PAGADO"]
[330,"1714783477 - DONOSO SALDARRIAGA JOSE DANIEL","SEUL","ENTRENADOR CLUB FILIAL",0,{"v":40,"d":"$40.00"},"PAGADO"]
[331,"1726671967 - REATEGUI  REATEGUI  MARISOL  ISABEL","SEUL","ENTRENADOR CLUB FILIAL",0,{"v":40,"d":"$40.00"},"PAGADO"]
[332,"1720105731 - VILLACRÉS MONTENEGRO JUAN MANUEL","SEUL","ENTRENADOR CLUB FILIAL",0,{"v":40,"d":"$40.00"},"PAGADO"]
[333,"1726058603 - MUÑOZ DIONISIO BRUSBY AYAEL","SEUL","ENTRENADOR CLUB FILIAL",{"v":20,"d":"$20.00"},{"v":20,"d":"$20.00"},"PAGADO"]
[334,"1709935405 - TUFIÑO ESPIN RUBEN SEGUNDO","SEUL","ENTRENADOR CLUB FILIAL",0,{"v":40,"d":"$40.00"},"PAGADO"]
[335,"1753402427 - MIZQUERO  NEIRA JOSE ARTURO","SEUL","ENTRENADOR CLUB FILIAL",0,0,"NO VINO"]
[336,"1723424089 - PAZMIÑO TORRES JUAN MATEO","SEUL","ENTRENADOR CLUB FILIAL",0,{"v":40,"d":"$40.00"},"PAGADO"]
[337,"1722538756 - MOLINA SAMANIEGO  CARLOS XAVIER","SEUL","OYENTE",0,{"v":10,"d":"$10.00"},"PAGADO"]
[338,"1723424097 - PAZMIÑO TORRES MARTIN SEBASTIAN","SEUL","OYENTE",0,{"v":10,"d":"$10.00"},"PAGADO"]
[339,"1727132928 - YEROVI JÁCOME DANNY MATÍAS","SEUL","OYENTE",0,{"v":10,"d":"$10.00"},"PAGADO"]
[340,"1302536899 - VELEZ GILER CARLOS EDILIO","SHOGUN","DIRECTOR CLUB FILIAL",0,{"v":30,"d":"$30.00"},"PAGADO"]
[341,"1718723016 - CAMACHO ROMERO RONNY MICHAEL","SHOGUN","MONITOR CLUB FILIAL",0,{"v":40,"d":"$40.00"},"PAGADO"]
[342,"1718384728 - MOSQUERA OLEASS SANTIAGO RENE","SHOGUN","MONITOR CLUB FILIAL",0,{"v":40,"d":"$40.00"},"PAGADO"]
[346,"1708473416 - MOGOLLÓN VASCO MARCO POLO","SIMJANG TEAM","DIRECTOR CLUB FILIAL",0,{"v":30,"d":"$30.00"},"PAGADO"]
[347,"1715089759 - QUINTANA ENCALADA KERLY SUGEY","SIMJANG TEAM","MONITOR CLUB FILIAL",0,{"v":40,"d":"$40.00"},"PAGADO"]
[348,"1306951086 - MONTENEGRO GARCIA HARMIN ROBERTO","SIMJANG TEAM","MONITOR CLUB FILIAL",0,{"v":40,"d":"$40.00"},"PAGADO"]
[349,"1726039488 - NIETO QUINTANA MARIUXI SUGEY","SIMJANG TEAM","MONITOR CLUB FILIAL",0,{"v":40,"d":"$40.00"},"PAGADO"]
[350,"1711509602 - REINOSO CUEVA CARLOS ALBERTO","S. D. CENTRAL","DIRECTOR CLUB FILIAL",{"v":30,"d":"$30.00"},0,"PAGADO"]
[351,"1150240040 - ALVAREZ LOJA JULIO  ANDRES","S. D. CENTRAL","MONITOR CLUB FILIAL",{"v":40,"d":"$40.00"},0,"PAGADO"]
[352,"1750726570 - BARRAZUETA ESPINOZA ISABELLA  ARIANE","S. D. CENTRAL","MONITOR CLUB FILIAL",{"v":40,"d":"$40.00"},0,"PAGADO"]
[353,"1725980039 - MOLINA MAYULEMA DILAN JHOSUE","S. D. CENTRAL","MONITOR CLUB FILIAL",{"v":40,"d":"$40.00"},0,"PAGADO"]
[354,"1718251224 - BARAHONA  CARVAJAL  AXEL  RENATO","S. D. CENTRAL","ENTRENADOR CLUB FILIAL",{"v":40,"d":"$40.00"},0,"PAGADO"]
[355,"1750817965 - MARTINEZ HIDALGO CAMILA RAQUEL","S. D. CENTRAL","ENTRENADOR CLUB FILIAL",{"v":40,"d":"$40.00"},0,"PAGADO"]
[356,"1706791934 - MANTILLA  MORALES DANNY  ALEXANDER","S. D. CENTRAL","ENTRENADOR CLUB FILIAL",{"v":40,"d":"$40.00"},0,"PAGADO"]
[357,"1728945252 - OSCULLO MOREIRA ADONYS DENNIS","S. D. CENTRAL","ENTRENADOR CLUB FILIAL",{"v":40,"d":"$40.00"},0,"PAGADO"]
[358,"1713277570 - MORAN VASQUEZ JOSE GUILLERMO","S. D. CENTRAL","ENTRENADOR CLUB FILIAL",{"v":40,"d":"$40.00"},0,"PAGADO"]
[359,"1723952568 - NASIMBA VILLARREAL BRYAN JOSUE","S. D. CENTRAL","ENTRENADOR CLUB FILIAL",{"v":40,"d":"$40.00"},0,"PAGADO"]
[360,"1755332333 - ÑACATA SUNTAXI MARIA STEFANIA","S. D. CENTRAL","ENTRENADOR CLUB FILIAL",{"v":40,"d":"$40.00"},"","PAGADO"]
[361,"1755918875 - REINOSO RAMIREZ CARLOS  ANDRES","S. D. CENTRAL","ENTRENADOR CLUB FILIAL",{"v":40,"d":"$40.00"},0,"PAGADO"]
[362,"1726910803 - SALAZAR AYO JOHNNY ARIEL","S. D. CENTRAL","ENTRENADOR CLUB FILIAL",{"v":40,"d":"$40.00"},0,"PAGADO"]
[363,"1712640588 - COLA ÑACATA WILLIAM JIMMY","S. D. CENTRAL","ENTRENADOR CLUB FILIAL",0,{"v":40,"d":"$40.00"},"PAGADO"]
[364,"1712918893 - ÑACATO SISALEMA ROBERTO GERMAN","S. D. CENTRAL","ENTRENADOR CLUB FILIAL",0,{"v":40,"d":"$40.00"},"PAGADO"]
[365,"0706498805 - PAUCAR   AMON JAY ALEXANDER","S. D. CENTRAL","ENTRENADOR CLUB FILIAL",0,{"v":40,"d":"$40.00"},"PAGADO"]
[366,"1718189937 - BARAHONA  CARVAJAL  ERICK FERNANDO","S. D. CENTRAL","ENTRENADOR CLUB FILIAL",0,{"v":40,"d":"$40.00"},"PAGADO"]
[367,"1727492231 - GARCIA MONTENEGRO ANTHONELLA BETSABE","S. D. CENTRAL","OYENTE",{"v":10,"d":"$10.00"},0,"PAGADO"]
[368,"1714765128 - GALLARDO MARCILLO EDISON GEOVANNI","SURYUN","DIRECTOR CLUB FILIAL",0,{"v":30,"d":"$30.00"},"PAGADO"]
[369,"1752855518 - CASTAÑEDA CANTERO JOSE MARTIN","SURYUN","MONITOR CLUB FILIAL",0,{"v":40,"d":"$40.00"},"PAGADO"]
[370,"1712509700 - MUÑOZ HIDALGO FREDDY  FERNANDO","SURYUN","ENTRENADOR CLUB FILIAL",0,{"v":40,"d":"$40.00"},"PAGADO"]
[371,"1750761692 - CISNEROS GUERRERO EMILIO JOSUE","SURYUN","ENTRENADOR CLUB FILIAL",0,{"v":40,"d":"$40.00"},"PAGADO"]
[372,"1750818849 - RUIZ PAUCAR DIEGO DAVID","SURYUN","ENTRENADOR CLUB FILIAL",0,{"v":40,"d":"$40.00"},"PAGADO"]
[373,"1753126968 - GALLARDO ZURITA MISHELL ESTEFANIA","SURYUN","ENTRENADOR CLUB FILIAL",0,{"v":40,"d":"$40.00"},"PAGADO"]
[374,"2150186100 - CRUZ VAZQUEZ JOSE FRANCISCO","SURYUN","ENTRENADOR CLUB FILIAL",0,{"v":40,"d":"$40.00"},"PAGADO"]
[375,"1705519492 - ARTEAGA - EDWIN  RUBEN","TAE BAEK","DIRECTOR CLUB FILIAL",0,{"v":30,"d":"$30.00"},"PAGADO"]
[376,"1753707726 - SIERRA CRUZ VANESSA ESTEFANYA","TAE BAEK","ENTRENADOR CLUB FILIAL",0,{"v":40,"d":"$40.00"},"PAGADO"]
[377,"1753574225 - CADENA VERGARA MICHAEL ISAAC","TAE BAEK","ENTRENADOR CLUB FILIAL",0,{"v":40,"d":"$40.00"},"PAGADO"]
[378,"1726477621 - SIGUENCIA ESPINOZA JONNY ALEXANDER","TAE BAEK","ENTRENADOR CLUB FILIAL",0,{"v":40,"d":"$40.00"},"PAGADO"]
[379,"1750069229 - ARTEAGA MORA JEAN PIERRE","TAE BAEK","ENTRENADOR CLUB FILIAL",0,{"v":40,"d":"$40.00"},"PAGADO"]
[380,"1714551304 - ARTEAGA LANDETA  EDWIN JAVIER","TAE BAEK JUNIOR","DIRECTOR CLUB FILIAL",0,{"v":30,"d":"$30.00"},"PAGADO"]
[381,"1755202627 - AGUIRRE ROSERO KRISTIAN ANDRÉS","TAE BAEK JUNIOR","MONITOR CLUB FILIAL",0,{"v":40,"d":"$40.00"},"PAGADO"]
[382,"1752528727 - GARCIA  MUNOZ ALLISON BRITANNY","TAE BAEK JUNIOR","OYENTE",0,{"v":10,"d":"$10.00"},"PAGADO"]
[383,"1755260195 - SUAREZ TANDAYAMO YURAC AMIJAIL","TAE BAEK JUNIOR","OYENTE",0,{"v":10,"d":"$10.00"},"PAGADO"]
[384,"1750684795 - TUPIZA  CUASCOTA  MARIANA CECIBEL","TAE BAEK JUNIOR","OYENTE",0,{"v":10,"d":"$10.00"},"PAGADO"]
[385,"1755643002 - ECHEVERRIA CHACHA MARX ISMAEL","TAE BAEK JUNIOR","OYENTE",0,{"v":10,"d":"$10.00"},"PAGADO"]
[386,"1750741108 - VELASCO ZAPATA YAMILETH KAORLI","TAE BAEK JUNIOR","OYENTE",0,{"v":10,"d":"$10.00"},"PAGADO"]
[387,"1204153793 - ESPINOZA  ROCA PEDRO  GEOVANNI","TAE BAEK JUNIOR","OYENTE",0,{"v":10,"d":"$10.00"},"PAGADO"]
[388,"1750127654 - NEGRETE BUITRON PABLO ALEJANDRO","TAE BAEK JUNIOR","OYENTE",0,{"v":10,"d":"$10.00"},"PAGADO"]
[389,"1750146555 - PALACIOS BUITRON ELISA ELISA","TAE BAEK JUNIOR","OYENTE",0,{"v":10,"d":"$10.00"},"PAGADO"]
[390,"1729502961 - AGUILAR DIAZ NAHIR NAHIR","TAE BAEK JUNIOR","OYENTE",0,{"v":10,"d":"$10.00"},"PAGADO"]
[391,"0550820020 - ZALDUMBIDE OÑA ADELA  CAROLINE","TAE BAEK JUNIOR","OYENTE",0,{"v":10,"d":"$10.00"},"PAGADO"]
[392,"1713031365 - LASCANO  DELGADO  LEOPOLDO  VICENTE","TAE DO ACADEMY","DIRECTOR CLUB FILIAL",0,{"v":30,"d":"$30.00"},"PAGADO"]
[393,"1754105185 - ARMIJOS PILAPAÑA ALISSON MAYELI","TAE DO ACADEMY","MONITOR CLUB FILIAL",0,{"v":40,"d":"$40.00"},"PAGADO"]
[394,"1728473842 - ROSERO HUILCA AILEEN BETSABE","TAE DO ACADEMY","MONITOR CLUB FILIAL",0,{"v":40,"d":"$40.00"},"PAGADO"]
[395,"1751004639 - VILLAFUERTE MERINO LUNA CAMILA","TAE DO ACADEMY","MONITOR CLUB FILIAL",0,{"v":40,"d":"$40.00"},"PAGADO"]
[396,"1752302206 - REYES RAMOS ELIZABETH ANTONELLA","TAE DO ACADEMY","MONITOR CLUB FILIAL",0,{"v":40,"d":"$40.00"},"PAGADO"]
[397,"1705094272 - OCHOA PEREZ EDWIN MARCELO","TAE SHO KU","DIRECTOR CLUB FILIAL",0,{"v":30,"d":"$30.00"},"PAGADO"]
[398,"1751599745 - CUNALATA GUANO JOEL ALEXANDER","TAE SHO KU","MONITOR CLUB FILIAL",{"v":40,"d":"$40.00"},0,"PAGADO"]
[399,"1719753350 - TOABANDA CRIOLLO CHRISTIAN  FERNANDO","TAE SHO KU","MONITOR CLUB FILIAL",0,{"v":40,"d":"$40.00"},"PAGADO"]
[400,"1727343533 - MONTENEGRO SOLORZANO EDWIN PATRICIO","TAE SHO KU","MONITOR CLUB FILIAL",{"v":40,"d":"$40.00"},0,"PAGADO"]
[401,"1710179282 - LOYA CONDE JUAN GUSTAVO","TAE SHO KU","ENTRENADOR CLUB FILIAL",0,{"v":40,"d":"$40.00"},"PAGADO"]
[402,"2200513063 - ESTRELLA ESCOBAR GISSELL DOMENICA","TAE SHO KU","ENTRENADOR CLUB FILIAL",0,0,"DEBE"]
[403,"1710112861 - PEREZ BENAVIDES DANILO XAVIER","TAEGUK JUCARO","DIRECTOR CLUB FILIAL",0,{"v":30,"d":"$30.00"},"PAGADO"]
[404,"1750295543 - PEREZ GARZON BRITANI DANIELA","TAEGUK JUCARO","ENTRENADOR CLUB FILIAL",0,{"v":40,"d":"$40.00"},"PAGADO"]
[405,"1709536252 - CHIRIBOGA NOVILLO JOSE ANTONIO","TEAM TAURO","DIRECTOR CLUB FILIAL",{"v":30,"d":"$30.00"},0,"PAGADO"]
[406,"1713520797 - LOPEZ CHICAIZA GUSTAVO GIOVANNY","TEAM TEKKEN","DIRECTOR CLUB FILIAL",0,{"v":30,"d":"$30.00"},"PAGADO"]
[407,"1727331587 - LOPEZ LUSORIAGA STEVEN ALEXANDER","TEAM TEKKEN","ENTRENADOR CLUB FILIAL",0,{"v":40,"d":"$40.00"},"PAGADO"]
[408,"1725186920 - DE LA VEGA  SARANSIG DANIEL ALEXANDER","TEAM VENCEDORES","DIRECTOR CLUB FILIAL",0,{"v":30,"d":"$30.00"},"PAGADO"]
[409,"1753084316 - GUAMANGALLO  SINCHIGUANO  KEVIN  MARTIN","TEAM VENCEDORES","MONITOR CLUB FILIAL",0,{"v":40,"d":"$40.00"},"PAGADO"]
[410,"1720049038 - CASTILLO  CUENCA CECILIA  NARCIZA","TEAM VENCEDORES","ENTRENADOR CLUB FILIAL",0,{"v":40,"d":"$40.00"},"PAGADO"]
[411,"0602527707 - AUCANCELA MORA RAÚL EFRAÍN","TOTAL KOMBAT","DIRECTOR CLUB FILIAL",0,{"v":30,"d":"$30.00"},"PAGADO"]
[412,"1725520900 - VALDIVIESO DIÁZ DAYANA  IBETH","TOTAL KOMBAT","MONITOR CLUB FILIAL",0,{"v":40,"d":"$40.00"},"PAGADO"]
[413,"1751519222 - JIMÉNEZ SANGUÑA BRITANY ESTEFANÍA","TOTAL KOMBAT","MONITOR CLUB FILIAL",0,{"v":40,"d":"$40.00"},"PAGADO"]
[414,"1726447699 - HERNÁNDEZ NÉNGER WHITMAN ALEXIS","TOTAL KOMBAT","MONITOR CLUB FILIAL",0,{"v":40,"d":"$40.00"},"PAGADO"]
[415,"1750271288 - ANDRADE CHAFLA ELIANA VALENTINA","TOTAL KOMBAT","MONITOR CLUB FILIAL",0,{"v":40,"d":"$40.00"},"PAGADO"]
[416,"1721855326 - CONGO AGUAS NIXON FABRICIO","TOTAL KOMBAT","MONITOR CLUB FILIAL",0,{"v":40,"d":"$40.00"},"PAGADO"]
[417,"1729082303 - CUASIALPUD SÁNCHEZ STEVEN ALEJANDRO","TOTAL KOMBAT","MONITOR CLUB FILIAL",0,{"v":40,"d":"$40.00"},"PAGADO"]
[418,"1724584469 - YÉPEZ LEÓN JUAN ALEJANDRO","TOTAL KOMBAT","MONITOR CLUB FILIAL",0,{"v":40,"d":"$40.00"},"PAGADO"]
[419,"1717926099 - DIAZ TORRES MARIA DEL CISNE .","TOTAL KOMBAT","MONITOR CLUB FILIAL",0,{"v":40,"d":"$40.00"},"PAGADO"]
[420,"1752323830 - AUCANCELA LIMA KATHERINE ODALIS","TOTAL KOMBAT","ENTRENADOR CLUB FILIAL",0,{"v":40,"d":"$40.00"},"PAGADO"]
[421,"1708251366 - CAIZA CAJILEMA CARLOS CARLOS","TOTAL KOMBAT","ENTRENADOR CLUB FILIAL",0,{"v":40,"d":"$40.00"},"PAGADO"]
[422,"1717913022 - TASIGUANO TAIPE JAVIER IVAN","TOTAL KOMBAT","ENTRENADOR CLUB FILIAL",0,{"v":40,"d":"$40.00"},"PAGADO"]
[423,"1718801358 - PAREDES ZAPATA BRYAN  PATRICIO","TOTAL KOMBAT","ENTRENADOR CLUB FILIAL",0,{"v":40,"d":"$40.00"},"PAGADO"]
[424,"1721886081 - LLAMUCA PALACIOS GUSTAVO ADOLFO","TOTAL KOMBAT","ENTRENADOR CLUB FILIAL",0,{"v":40,"d":"$40.00"},"PAGADO"]
[425,"1753113107 - SARANGO CHAUCA AARON STIPE","TOTAL KOMBAT","ENTRENADOR CLUB FILIAL",0,{"v":40,"d":"$40.00"},"PAGADO"]
[426,"1727092130 - CONGO AGUAS SANDRA ELIZABETH","TOTAL KOMBAT","ENTRENADOR CLUB FILIAL",0,{"v":40,"d":"$40.00"},"PAGADO"]
[427,"1724970072 - BASANTES CORRALES SARA ELIZABETH","UNIVERSIDAD USFQ","MONITOR CLUB FILIAL",0,{"v":40,"d":"$40.00"},"PAGADO"]
[428,"1713849089 - RODRIGUEZ GUERRON PABLO WILSON","YONG TIGER","DIRECTOR CLUB FILIAL",0,0,"PASO POR  COLABORACIÓN"]
[429,"1717123309 - MOROCHO  CATOTA NANCY CAROLINA","YONG TIGER","ENTRENADOR CLUB FILIAL",0,{"v":40,"d":"$40.00"},"PAGADO"]
[430,"1724685795 - MOROCHO CATOTA WENDY  AVIGAIL","YONG TIGER","ENTRENADOR CLUB FILIAL",0,{"v":40,"d":"$40.00"},"PAGADO"]
[431,"1712289147 - EMPERATRIZ QUINGA","JITAE","ENTRENADOR CLUB FILIAL",0,{"v":45,"d":"$45.00"},"PAGADO "]
[432,"1710842137 - JUAN PACHACAMA","JITAE","DIRECTOR CLUB FILIAL",0,{"v":35,"d":"$35.00"},"PAGADO "]
[434.000399840064,"1752431260 - IAN CATOTA","LEON","ENTRENADOR CLUB FILIAL",0,{"v":40,"d":"$40.00"},"PAGADO"]
[435.030697398459,"1752431120 - JOEL CATOTA","LEON","ENTRENADOR CLUB FILIAL",0,{"v":40,"d":"$40.00"},"PAGADO"]
[436.060994956855,"1704337367 LUIS BURBANO","PIO MEJIA","DIRECTOR CLUB FILIAL",0,{"v":30,"d":"$30.00"},"PAGADO"]
[437.091292515251,"1719596858 CARLA BURNANO","PIO MEJIA","ENTRENADOR CLUB FILIAL",0,{"v":40,"d":"$40.00"},"PAGADO"]
[438.121590073647,"1723424885 MARTIN MENDOZA","VENON","ENTRENADOR  CLUB FILIAL",0,{"v":40,"d":"$40.00"},"PAGADO"]
[439.151887632043,"0200894095 JORGE SISALEMA","UNIVERSAL","DIRECTOR CLUB FILIAL",0,{"v":30,"d":"$30.00"},"PAGADO"]
[440.182185190439,"PABLO COBOS","CHEHU","DIRECTOR CLUB FILIAL",0,{"v":30,"d":"$30.00"},"PAGADO"]
[441.212482748835,"1705918314 MARLON LEMA","MASTER HOME","DIRECTOR",{"v":30,"d":"$30.00"},0,"PAGADO"]
[442.242780307231,"JORGE NARANJO","MASTER HOME","ENTRENADOR CLUB FILIAL",0,{"v":40,"d":"$40.00"},"PAGADO"]
[443.273077865627,"1753221504 JOSUE SUNTAXI","MASTER HOME","ENTRENADOR CLUB FILIAL",{"v":20,"d":"$20.00"},{"v":20,"d":"$20.00"},"PAGADO"]
[444.303375424023,"MARY MANZANO","JUVENTUS","ENTRENADOR CLUB FILIAL",0,{"v":40,"d":"$40.00"},"PAGADO"]
[445.333672982419,"1750102251 ISRAEL ANDRADE ESPINOZA","ASOCIACION TKDP","MONITOR CLUB FILIAL",{"v":40,"d":"$40.00"},0,"PAGADO"]
[446.363970540815,"1711911626 MARY MANZANO","JUVENTUS","ENTRENADOR",0,{"v":40,"d":"$40.00"},"PAGADO"]
[447.394268099211,"ANGELICA GUERRERO","SEUL","ENTRENADOR",0,{"v":40,"d":"$40.00"},"PAGADO"]
[448.424565657607,"MARCO VEINTIMILLA","TEAN VEINTIMILLA","ENTRENADOR NO FILIAL",0,{"v":40,"d":"$40.00"},"PAGADO"]
[449.454863216003,"17105277513 HERNAN VILLACIS","VIL GYM","DIRECTOR CLUB FILIAL",0,{"v":30,"d":"$30.00"},"PAGADO"]
[450.485160774399,"1717191850 FERNANDO TIPAN","SAN SEBASTIAN","ENTRENADOR CLUB FILIAL",0,{"v":40,"d":"$40.00"},"PAGADO"]
["TOTAL",{"$nulls":3},{"$f":"SUM(E6:E448)","v":{"v":2894,"d":"$2,894.00"}},{"$f":"SUM(F6:F448)","v":{"v":12875,"d":"$12,875.00"}}]
[]
[]
[null,"INGRESOS"]
[null,"INSCRIPCIONES EFECTIVO",{"$f":"E449","v":{"v":2894,"d":"$ 2,894.00"}}]
[null,"INSCRIPCIONES TRANSFERENCIA",{"$f":"F449","v":{"v":12875,"d":"$ 12,875.00"}}]
[null,"TOTAL",{"$f":"SUM(C453:C454)","v":{"v":15769,"d":"$ 15,769.00"}}]
[]
[]
[null,"EGRESOS"]
[null,"REFRIGERIOS ",{"v":13.25,"d":"$ 13.25"}]
[null,"REFRIGERIOS ",{"v":16,"d":"$ 16.00"}]
[null,"HOJAS Y COPIAS",{"v":15,"d":"$ 15.00"}]
[null,"PLACAS CLUB SEUL",{"v":43,"d":"$ 43.00"}]
[null,"PRODUCTOS DE CAFETERÍA (VASOS, AZÚCAR, CAFÉ, CUCHARAS ETC.)",{"v":93.19,"d":"$ 93.19"}]
[null,"ENSALADAS DE FRUTAS",{"v":36,"d":"$ 36.00"}]
[null,"CERTIFICADOS, FUNDAS Y TRANSPORTE",{"v":195,"d":"$ 195.00"}]
[null,"ALMUERZOS",{"v":119.2,"d":"$ 119.20"}]
[null,"PROPINA",{"v":2.8,"d":"$ 2.80"}]
[null,"DEVOLUCIÓN MIRIAM HERRERA CURSO",{"v":30,"d":"$ 30.00"}]
[null,"SONIDO, VIDEO Y PANTALLA",{"v":1300,"d":"$ 1,300.00"}]
[null,"EXPOSITOR PEDRO GÓMEZ",{"v":750,"d":"$ 750.00"}]
[null," PASAJES EXPOSIROR Y GASTOS VARIOS",{"v":4530,"d":"$ 4,530.00"}]
[null,"DESAYUNO ENTRENADORES",{"v":25.23,"d":"$ 25.23"}]
[null,"PERSONAL APOYO DURANTE EL CURSO",{"v":840,"d":"$ 840.00"}]
[null,"CONTRATACIÓN ZOOM",{"v":79,"d":"$ 79.00"}]
[null,"MARCELO TROYA EXPOSITOR",{"v":200,"d":"$ 200.00"}]
[null,"REFRIGERIOS DESPUES EVENTO",{"v":154.15,"d":"$ 154.15"}]
[null,"FERNANDO CAÑADA EXPOSITOR",{"v":240,"d":"$ 240.00"}]
[null,"ENVÍO PAGO F. CAÑADA (WESTERN UNION)",{"v":22.08,"d":"$ 22.08"}]
[null,"EDWIN BALLAGÁN EXPOSITOR",{"v":120,"d":"$ 120.00"}]
[null,"TOTAL",{"$f":"SUM(C459:C479)","v":{"v":8823.9,"d":"$ 8,823.90"}}]
[]
[]
[null,"INGRESOS",{"$f":"C455","v":{"v":15769,"d":"$ 15,769.00"}}]
[null,"EGRESOS",{"$f":"-C480","v":{"v":-8823.9,"d":"$ (8,823.90)"}}]
[null,"SALDO",{"$f":"C483+C484","v":{"v":6945.1,"d":"$ 6,945.10"}}]
[]
[null,"POR COBRAR"]
[null,"CLUB","VALOR"]
[null,"APOLO (VARIOS) CARTA SOLICITUD DE PAGO EN ABRIL",{"v":150,"d":"$150.00"},"SOLICITUD FORMAL PARA REALIZAR PAGO EN ABRIL"]
[null,"TAE SHO KU (ESTRELLA GISSELL)",{"v":40,"d":"$40.00"},"DESCUENTO EN EVENTOS DE ARBITRAJE"]
[null,"ECUADCUBA (EDDY CAJIGAL)",{"v":40,"d":"$40.00"},"DESCUENTO SEMINARIO DE ASCENSOS JUNIO"]
[null,"TOTAL",{"$f":"SUBTOTAL(9,C489:C491)","v":{"v":230,"d":"$230.00"}}]

{"sheet":"I SELECTIVO CAD, JUN Y JUV","index":11,"n_rows":73,"n_cols":9,"rows_kept":73,"merged":[[0,0,0,8],[1,0,1,8],[2,0,2,8],[41,0,41,2],[43,1,43,2],[51,1,51,2]]}
["ASOCIACIÓN DE TAEKWONDO DE PICHINCHA"]
["I SELECTIVO CADETES, JUNIOR Y JUVENIL 2025"]
["COLISEO DE SANGOLQUÍ 16-02-2025"]
[]
["N°","CLUBES PARTICIPANTES","SIGLAS","DEPORTISTAS","ENTRENADORES","TARDÍA/CAMBIO","EFECTIVO","TRANSFERENCIA","ESTADO"]
[1,"ARES","ARE",3,2,"1 TARDÍA",{"v":20,"d":"$20.00"},0,"PAGADO"]
[2,"BAEKJUL TAEKWONDO","BKJ",7,3,null,{"v":35,"d":"$35.00"},0,"PAGADO"]
[3,"BAS PANTHERS","BSP",3,1,null,{"v":15,"d":"$15.00"},0,"PAGADO"]
[4,"BLUE DRAGONS","BDR",4,2,null,0,{"v":20,"d":"$20.00"},"PAGADO"]
[5,"BORJA’S LIONS","BLS",12,5,"3 CAMBIOS",0,{"v":80,"d":"$80.00"},"PAGADO"]
[7,"CIUDAD DE QUITO","CDQ",1,1,null,0,{"v":5,"d":"$5.00"},"PAGADO"]
[8,"CLUB TAE WOONG","TWG",2,1,"1 TARDÍA",0,{"v":20,"d":"$20.00"},"PAGADO"]
[9,"DEBAK TKD","DBK",4,2," ",null,{"v":12,"d":"$12.00"},"PAGADO"]
[10,"DECIAP","DEC",5,4,null,0,0,"PASO CURSO"]
[11.2777777777778,"DRACO","DRA",5,1,"2 CAMBIOS",0,{"v":35,"d":"$35.00"},"PAGADO"]
[12.4444444444445,"ECUADCUBA","ECB",2,1,null,{"v":10,"d":"$10.00"},0,"PAGADO"]
[13.6111111111111,"EQUILIBRIO","EQU",1,1,null,{"v":5,"d":"$5.00"},0,"PAGADO"]
[14.7777777777778,"FARANG","FRG",1,1,null,{"v":5,"d":"$5.00"},0,"PAGADO"]
[15.9444444444445,"FIRST CLASS CALDERÓN","FCE",4,1,"4 TARDÍAS",0,{"v":22,"d":"$22.00"},"PAGADO"]
[17.1111111111111,"FURIA NEGRA","CFN",4,2,"2 TARDÍAS",{"v":30,"d":"$30.00"},0,"PAGADO"]
[18.2777777777778,"HANSU CAYAMBE","CAY",10,2,null,{"v":50,"d":"$50.00"},0,"PAGADO"]
[19.4444444444445,"HUANG TOP GYM","HTG",1,1,null,0,{"v":5,"d":"$5.00"},"PAGADO"]
[20.6111111111111,"JERATHEL","JER",1,1,null,{"v":5,"d":"$5.00"},{"v":5,"d":"$5.00"},"PAGADO"]
[21.7777777777778,"KO AMERICA","KOA",5,1,"1 TARDÍA 2 CAMBIOS",0,{"v":40,"d":"$40.00"},"PAGADO"]
[22.9444444444445,"KORYO","KOR",1,0,"1 TARDÍA",{"v":10,"d":"$10.00"},0,"PAGADO"]
[24.1111111111111,"KUMGANG DUL","KGD",3,2,"1 TARDÍA",0,{"v":20,"d":"$20.00"},"PAGADO"]
[25.2777777777778,"KYORUGUI GYM","KRG",3,2,null,{"v":15,"d":"$15.00"},0,"PAGADO"]
[26.4444444444445,"LIGA CANTONAL MEJÍA","LCM",3,2,null,{"v":15,"d":"$15.00"},0,"PAGADO"]
[27.6111111111111,"LOS PUMAS","PUM",5,1,null,0,{"v":15,"d":"$15.00"},"PAGADO"]
[28.7777777777778,"MERCENARIOS","MER",7,2,null,0,{"v":35,"d":"$35.00"},"PAGADO"]
[29.9444444444445,"MOODUKKWAN TRAINING C","TTC",3,1,"3 TARDÍAS",0,{"v":20,"d":"$20.00"},"PAGADO"]
[31.1111111111111,"ROJAS IAN IRON FIST","PVM",3,1,null,0,{"v":15,"d":"$15.00"},"PAGADO"]
[32.2777777777778,"SAN SEBASTIAN","SSB",1,1,null,{"v":5,"d":"$5.00"},0,"PAGADO"]
[33.4444444444445,"SEUL","SEU",12,4,"1 CAMBIO",{"v":65,"d":"$65.00"},0,"PAGADO"]
[34.6111111111111,"SIMJANG TEAM","SIM",1,2,"2 CAMBIO",{"v":10,"d":"$10.00"},0,"PAGADO"]
[35.7777777777778,"S. D. CENTRAL","SDC",13,5,"2 TARDÍAS",{"v":75,"d":"$75.00"},0,"PAGADO"]
[36.9444444444445,"TAE BAEK","TBK",1,4,null,0,{"v":5,"d":"$5.00"},"PAGADO"]
[38.1111111111111,"TAE BAEK JUNIOR","TBK",4,2,"2 CAMBIOS",0,{"v":30,"d":"$30.00"},"PAGADO"]
[39.2777777777778,"TAE DO ACADEMY","TDO",1,1,null,{"v":5,"d":"$5.00"},0,"PAGADO"]
[40.4444444444445,"TAE SHO KU","TSK",4,3,null,0,{"v":20,"d":"$20.00"},"PAGADO"]
[41.6111111111111,"YONG TIGER","YON",3,2,null,{"v":15,"d":"$15.00"},0,"PAGADO"]
["TOTAL INSCRITOS",null,null,{"$f":"SUM(D6:D41)","v":143},{"$f":"SUM(E6:E41)","v":68},null,{"$f":"SUM(G6:G41)","v":{"v":390,"d":"$390.00"}},{"$f":"SUM(H6:H41)","v":{"v":404,"d":"$404.00"}}]
[]
[null,"INGRESOS"]
[null,"INSCRIPCIONES EFECTIVO",{"$f":"G42","v":{"v":390,"d":"$ 390.00"}}]
[null,"INSCRIPCIONES TRANSFERENCIA",{"$f":"H42","v":{"v":404,"d":"$ 404.00"}}]
[null,"TAQUILLA",{"v":355,"d":"$ 355.00"}]
[null,"FONDOS CDP PARA ARBITRAJE",{"v":400,"d":"$ 400.00"}]
[null,"TOTAL",{"$f":"SUM(C45:C48)","v":{"v":1549,"d":"$ 1,549.00"}}]
[]
[]
[null,"EGRESOS"]
[null,"HIDRATACIÓN STAFF",{"v":16,"d":"$ 16.00"}]
[null,"PRODUCTOS DE LIMPIEZA (PAPEL HIGIÉNICO Y FUNDAS)",{"v":20,"d":"$ 20.00"}]
[null,"MASKING PARA LIMITAR CANCHAS",{"v":15,"d":"$ 15.00"}]
[null,"DESAYUNOS Y ALMUERZOS STAFF",{"v":165,"d":"$ 165.00"}]
[null,"TRANSPORTE",{"v":5,"d":"$ 5.00"}]
[null,"AMBULANCIA Y PARAMÉDICOS",{"v":165,"d":"$ 165.00"}]
[null,"ALQUILER SISTEMA Y COMPUTADOR ",{"v":50,"d":"$ 50.00"}]
[null,"CONGRESILLO",{"v":20,"d":"$ 20.00"}]
[null,"ELABORACIÓN DE LLAVES DÍAS DE TRABAJO ",{"v":60,"d":"$ 60.00"}]
[null,"PAGO ARBITRAJE",{"v":600,"d":"$ 600.00"}]
[null,"LIMPIEZA DE BAÑOS",{"v":30,"d":"$ 30.00"}]
[null,"LIMPIEZA DE COLISEO",{"v":50,"d":"$ 50.00"}]
[null,"PAGO STAFF (PERSONAL DE APOYO)",{"v":420,"d":"$ 420.00"}]
[null,"DEVOLUCIÓN BORJA'S LIONS",{"v":5,"d":"$ 5.00"}]
[null,"GRAPADORA PEQUEÑA",{"v":3,"d":"$ 3.00"}]
[null,"TOTAL",{"$f":"SUM(C53:C67)","v":{"v":1624,"d":"$ 1,624.00"}}]
[]
[]
[null,"INGRESOS",{"$f":"C49","v":{"v":1549,"d":"$ 1,549.00"}}]
[null,"EGRESOS",{"$f":"-C68","v":{"v":-1624,"d":"$ (1,624.00)"}}]
[null,"SALDO",{"$f":"C71+C72","v":{"v":-75,"d":"$ (75.00)"}}]

{"sheet":"I OPEN ASOTKD 2025 Y SELECTIVO","index":12,"n_rows":142,"n_cols":11,"rows_kept":142,"merged":[[0,0,0,9],[1,0,1,9],[2,0,2,9],[71,0,71,2],[74,1,74,2],[81,1,81,2]]}
["ASOCIACIÓN DE TAEKWONDO DE PICHINCHA"]
["I OPEN ASOTKD 2025, I SELECTIVO POOMSAE Y II SELECTIVO CADETES Y JUNIOR, I SELECTIVO INFANTIL A, B Y SUB 21"]
["COLISEO GENERAL RUMIÑAHUI 01 Y 02 DE MARZO"]
[]
["N°","CLUBES PARTICIPANTES","SIGLAS","OPEN COMBATE - POOMSAE","SELECTIVO COMBATE","SELECTIVO POOMSAE","TARDÍA / CAMBIO","EFECTIVO","TRANSFERENCIA","ESTADO"]
[1,"APOLO","APO",33,0,2,0,{"v":134,"d":"$134.00"},{"v":404,"d":"$404.00"},"PAGADO"]
[2,"ARES","ARE",17,1,1,0,{"v":275,"d":"$275.00"},{"v":7,"d":"$7.00"},"PAGADO"]
[3,"ASOCIACION TKDP","ASO",1,0,0,0,{"v":16,"d":"$16.00"},0,"PAGADO"]
[4,"ATLAS  1 PARATKD","ATL",9,0,0,0,{"v":80,"d":"$80.00"},{"v":48,"d":"$48.00"},"PAGADO"]
[5,"BAEKJUL TAEKWONDO","BKJ",12,11,0,1,{"v":252,"d":"$252.00"},0,"PAGADO"]
[6,"BAEKJUL TAEKWONDO","BKJ",17,0,0,1,0,{"v":277,"d":"$277.00"},"PAGADO"]
[7,"BAEKJUL TAEKWONDO","BKJ",2,0,0,1,0,{"v":32,"d":"$32.00"},"PAGADO"]
[8,"BAS PANTHERS","BSP",12,4,1,1,0,{"v":222,"d":"$222.00"},"PAGADO"]
[9,"BLUE DRAGONS","BDR",17,1,0,0,0,{"v":277,"d":"$277.00"},"PAGADO"]
[10,"CHAMPIONS FOR LIFE","CFL",8,1,0,0,0,{"v":133,"d":"$133.00"},"PAGADO"]
[11,"CHUNG SONG","CHS",35,0,0,2,{"v":224,"d":"$224.00"},{"v":346,"d":"$346.00"},"PAGADO"]
[12,"CIUDAD DE QUITO","CDQ",2,3,1,0,0,{"v":52,"d":"$52.00"},"PAGADO"]
[13,"CLUB  HAN KUM DO","HKD",20,0,0,0,0,{"v":320,"d":"$320.00"},"PAGADO"]
[14,"CLUB TAE WOONG","TWG",5,3,0,0,0,{"v":100,"d":"$100.00"},"PAGADO"]
[15,"DEBAK TKD","DBK",61,10,14,2,{"v":100,"d":"$100.00"},{"v":1000,"d":"$1,000.00"},"PAGADO"]
[16,"DOJANG TKD MELO","DTM",11,0,1,0,0,{"v":181,"d":"$181.00"},"PAGADO"]
[17,"DRAGON GYM","DRG",5,0,0,0,0,{"v":80,"d":"$80.00"},"PAGADO"]
[18,"EQUILIBRIO","EQU",5,0,0,0,{"v":80,"d":"$80.00"},0,"PAGADO"]
[19,"ESPE","ESP",11,0,0,0,{"v":181,"d":"$181.00"},0,"PAGADO"]
[20,"JERATHEL","JER",13,4,0,2,{"v":238,"d":"$238.00"},0,"PAGADO"]
[21,"JOSEON LEGACY","JOL",29,0,0,0,0,{"v":464,"d":"$464.00"},"PAGADO"]
[22,"JR SPORT","JRS",1,1,1,0,{"v":5,"d":"$5.00"},{"v":10,"d":"$10.00"},"PAGADO"]
[23,"KO AMERICA","KOA",29,3,0,5,0,{"v":504,"d":"$504.00"},"PAGADO"]
[24,"KOREAN DRAGON","KDR",3,0,0,0,0,{"v":48,"d":"$48.00"},"PAGADO"]
[25,"KUKKIWON","KUK",9,0,0,0,{"v":144,"d":"$144.00"},0,"PAGADO"]
[26,"KUMGANG DUL","KGD",4,3,0,1,0,{"v":84,"d":"$84.00"},"PAGADO"]
[27,"KYORUGUI GYM","KRG",24,6,1,1,{"v":434,"d":"$434.00"},0,"PAGADO"]
[28,"LEON","LEO",21,2,0,2,{"v":106,"d":"$106.00"},{"v":250,"d":"$250.00"},"PAGADO"]
[29,"LIGA CANTONAL DE MEJÍA","LCM",13,0,0,0,{"v":208,"d":"$208.00"},0,"PAGADO"]
[30,"LOS PUMAS","PUM",14,8,0,0,{"v":100,"d":"$100.00"},{"v":164,"d":"$164.00"},"PAGADO"]
[31,"MARCIAL CLUB GRANDA","MCG",13,0,0,1,0,{"v":213,"d":"$213.00"},"PAGADO"]
[32,"MERCENARIOS - 2","MER",14,15,0,0,{"v":40,"d":"$40.00"},{"v":231,"d":"$231.00"},"PAGADO"]
[33,"MICHAYDO","MCD",1,1,0,0,0,{"v":32,"d":"$32.00"},"PAGADO"]
[34,"MINOTAUROS ECU","MIN",8,0,0,2,{"v":10,"d":"$10.00"},{"v":128,"d":"$128.00"},"PAGADO"]
[35,"MOODUKKWAN TRAINING C","TTC",20,0,13,20,{"v":30,"d":"$30.00"},{"v":455,"d":"$455.00"},"PAGADO"]
[36,"PYONGYANG","PYO",11,0,0,0,0,{"v":176,"d":"$176.00"},"PAGADO"]
[37,"SAN FRANCISCO TIGRES 1P","SFT",10,0,2,0,{"v":154,"d":"$154.00"},0,"PAGADO"]
[38,"SAN SEBASTIAN","SSB",1,2,4,0,0,{"v":45,"d":"$45.00"},"PAGADO"]
[39,"SEUL  2 SISTE REPETIDO","SEU",11,12,12,0,{"v":5,"d":"$5.00"},{"v":291,"d":"$291.00"},"PAGADO"]
[40,"SHOGUN MENOS 1 2 SISTEM","OHS",12,1,0,0,0,{"v":183,"d":"$183.00"},"PAGADO"]
[41,"SIMJANG TEAM","SIM",11,6,0,4,{"v":226,"d":"$226.00"},0,"PAGADO"]
[42,"S.D.CENTRAL","SDC",19,22,0,0,0,{"v":441,"d":"$441.00"},"PAGADO"]
[43,"TAE BAEK JUNIOR","TBK",12,3,0,1,0,{"v":212,"d":"$212.00"},"PAGADO"]
[44,"TAE DO ACADEMY","TDO",11,2,6,2,{"v":22,"d":"$22.00"},{"v":204,"d":"$204.00"},"PAGADO"]
[45,"TAEGUK JUCARO","TJD",5,0,1,2,0,{"v":95,"d":"$95.00"},"PAGADO"]
[46,"TOTAL KOMBAT 1 PARATKD","TKT",22,0,0,1,{"v":154,"d":"$154.00"},{"v":187,"d":"$187.00"},"PAGADO"]
[47,"UNIVERSIDAD UTE","UTE",5,0,0,1,0,{"v":85,"d":"$85.00"},"PAGADO"]
[48,"BORJA LIONS","BLS",0,16,0,0,0,{"v":80,"d":"$80.00"},"PAGADO"]
[49,"DECIAP","DEC",0,6,0,0,{"v":30,"d":"$30.00"},0,"PAGADO"]
[50,"DRACO","DRA",0,9,0,0,0,{"v":45,"d":"$45.00"},"PAGADO"]
[51,"ECUACUBA","ECB",0,4,0,0,{"v":17,"d":"$17.00"},0,"PAGADO"]
[52,"FIRST CLASS CALDERON","FCE",0,4,0,0,0,{"v":20,"d":"$20.00"},"PAGADO"]
[53,"FURIA NEGRA","CFN",0,4,0,0,{"v":20,"d":"$20.00"},0,"PAGADO"]
[54,"HANSU CAYAMBE 2POR 3 SIS","CAY",0,20,4,0,{"v":110,"d":"$110.00"},0,"PAGADO"]
[55,"HUANG TOP GYM","HTG",0,1,0,0,0,{"v":5,"d":"$5.00"},"PAGADO"]
[56,"IL YO MP","ILY",0,1,0,0,0,{"v":5,"d":"$5.00"},"PAGADO"]
[57,"JIDOKWAN DC","JDK",0,1,0,0,{"v":5,"d":"$5.00"},0,"PAGADO"]
[58,"KORYO","KOR",0,3,0,0,{"v":15,"d":"$15.00"},0,"PAGADO"]
[59,"ROJAS IAN IRON FIST","PVM",0,5,0,0,{"v":25,"d":"$25.00"},0,"PAGADO"]
[60,"TAE BAEK ","TBK",0,3,1,0,0,{"v":20,"d":"$20.00"},"PAGADO"]
[61,"YONG TIGER","YON",0,6,2,0,{"v":25,"d":"$25.00"},{"v":15,"d":"$15.00"},"PAGADO"]
[62,"FARANG","FRG",0,1,0,0,{"v":5,"d":"$5.00"},0,"PAGADO"]
[63,"MIT - TKD","MIT",0,0,1,0,0,{"v":5,"d":"$5.00"},"PAGADO"]
[64,"RYONG TAE","RYT",0,0,1,0,{"v":5,"d":"$5.00"},0,"PAGADO"]
[65,"SURYUN","SRY",0,0,1,0,{"v":5,"d":"$5.00"},0,"PAGADO"]
[66,"TAE SHO KU","TSK",0,6,4,0,0,{"v":50,"d":"$50.00"},"PAGADO"]
["TOTAL ",null,null,{"$f":"SUM(D6:D71)","v":629},215,74,53,{"v":3480,"d":"$3,480.00"},{"v":8226,"d":"$8,226.00"}]
[]
[]
[null,"INGRESOS"]
[null,"INSCRIPCIONES EFECTIVO",{"$f":"H72","v":{"v":3480,"d":"$ 3,480.00"}}]
[null,"INSCRIPCIONES TRANSFERENCIA",{"$f":"I72","v":{"v":8226,"d":"$ 8,226.00"}}]
[null,"TAQUILLA",{"v":1097,"d":"$ 1,097.00"}]
[null,"TOTAL",{"$f":"SUM(C76:C78)","v":{"v":12803,"d":"$ 12,803.00"}}]
[]
[]
[null,"EGRESOS"]
[null,"DEVOLUCIÓN MARCO MOGOLLÓN TRÁMITES",{"v":52,"d":"$ 52.00"}]
[null,"PASO POR TRÁMITE SRI EDUARDO LOACHAMIN 348-181.SALDO 167",{"v":181,"d":"$ 181.00"}]
[null,"PRODUCTOS DE LIMPIEZA (PAPEL HIGIÉNICO Y FUNDAS)",{"v":12,"d":"$ 12.00"}]
[null,"HIDRATANTES Y REFRIGERIO ÁRBITROS Y STAFF JORNADA I",{"v":157,"d":"$ 157.00"}]
[null,"PAGO ARBITRAJE JORNADA 1 DE MARZO DE 2025",{"v":410,"d":"$ 410.00"}]
[null,"PAGO SERVICIO DE SEGURIDAD EN EVENTO (4 GUARDIAS)",{"v":120,"d":"$ 120.00"}]
[null,"PAGO STAFF JORNADA 1 DE MARZO DE 2025",{"v":205,"d":"$ 205.00"}]
[null,"DEVOLUCIÓN MARIO PINTO TRÁMITES",{"v":134,"d":"$ 134.00"}]
[null,"DESAYUNOS STAFF Y ÁRBITROS (SÁBADO Y DOMINGO)",{"v":275,"d":"$ 275.00"}]
[null,"PASO POR PRÉSTAMO DE EQUIPO ELECTRÓNICO PABLO TAYO",{"v":30,"d":"$ 30.00"}]
[null,"HIDRATANTES Y REFRIGERIO ÁRBITROS Y STAFF JORNADA I",{"v":129,"d":"$ 129.00"}]
[null,"MÉDICOS Y AMBULACIA (2 DÍAS)",{"v":400,"d":"$ 400.00"}]
[null,"SONIDO Y APLIFICACIÓN",{"v":250,"d":"$ 250.00"}]
[null,"PAGO ARBITRAJE JORNADA 2 DE MARZO DE 2025",{"v":1910,"d":"$ 1,910.00"}]
[null,"MEDALLAS",{"v":700,"d":"$ 700.00"}]
[null,"COMPRA DE 64 METROS DE TATAMI",{"v":960,"d":"$ 960.00"}]
[null,"ELABORACIÓN DE LLAVES Y 2 DÍAS DE TRABAJO FERNANDO MOYA ",{"v":250,"d":"$ 250.00"}]
[null,"CONGRESILLO",{"v":20,"d":"$ 20.00"}]
[null,"DOS SISTEMAS (2 DÍAS)",{"v":200,"d":"$ 200.00"}]
[null,"SISTEMA DE VIDEO REPLAY",{"v":40,"d":"$ 40.00"}]
[null,"PAGO POR INSCRIPIONES PÁGINA WEB CÉSAR TAYO",{"v":441.7,"d":"$ 441.70"}]
[null,"RUBRO PARA VIAJE A TOPE A PORTOVIEJO",{"v":1560,"d":"$ 1,560.00"}]
[null,"GEOVANNI ESPINOZA REDES Y COBERTURA EVENTOS 2 DÍAS",{"v":50,"d":"$ 50.00"}]
[null,"SISTEMAS ANGELO- CHINO Y TELAS COBERTORES JHONNY",{"v":420,"d":"$ 420.00"}]
[null,"ALMUERZOS JORNADA 1 DE MARZO DE 2025",{"v":391,"d":"$ 391.00"}]
[null,"PAGO SERVICIO DE SEGURIDAD EN EVENTO (2 GUARDIAS)",{"v":60,"d":"$ 60.00"}]
[null,"FLETES MENAJE DE COMPETENCIA",{"v":60,"d":"$ 60.00"}]
[null,"MONTAJE DE ESCENARIO (ARMADO 7 CANCHAS)",{"v":175,"d":"$ 175.00"}]
[null,"PAGO STAFF Y DIRECCIÓN DE EVENTOS 2 DÍAS 12 PERSONAS",{"v":720,"d":"$ 720.00"}]
[null,"TOTAL",{"$f":"SUM(C83:C111)","v":{"v":10312.7,"d":"$ 10,312.70"}}]
[]
[]
[null,"INGRESOS",{"$f":"C79","v":{"v":12803,"d":"$ 12,803.00"}}]
[null,"EGRESOS",{"$f":"-C112","v":{"v":-10312.7,"d":"$ (10,312.70)"}}]
[null,"SALDO",{"$f":"C115+C116","v":{"v":2490.2999999999993,"d":"$ 2,490.30"}}]
{"$rows_empty":24}
[{"$nulls":10}," "]

{"sheet":"PAGO DERECHO SEGUNDO EXAMEN ACR","index":13,"n_rows":81,"n_cols":7,"rows_kept":81,"merged":[[0,0,0,6],[3,6,6,6],[9,6,11,6],[13,6,14,6],[16,6,18,6],[39,6,40,6],[56,6,57,6]]}
["NÓMINA DE PAGO DE DERECHO DE SEGUNDO EXÁMEN DE ACREDITACIÓN DE ENTRENADORES"]
["Nº","NOMBRE Y APELLIDO","CLUB","FECHA DE PAGO","VALOR","COMPROBANTE"]
[1,"AMANDA VALLE ","MOODUKKWAN TRAINING CENTER","2025-01-24",{"v":5,"d":"$5.00"},null,24210779]
[2,"ZAID MONOSALVAS","ARES","2025-01-24",{"v":5,"d":"$5.00"},null,24468017]
[3,"LILIANA FARINANGO","ARES","2025-04-24",{"v":5,"d":"$5.00"}]
[4,"JOSÉ NEPAS","ARES","2025-01-24",{"v":5,"d":"$5.00"}]
[5,"FERNANDO MANOSALVAS","ARES","2025-01-24",{"v":5,"d":"$5.00"}]
[6,"JOSÉ LUIS MALDONADO","MOODUKKWAN TRAINING CENTER","2025-01-24",{"v":5,"d":"$5.00"}]
[7,"YANICE RODRÍGUEZ ","BORJA'S LIONS","2025-01-24",{"v":5,"d":"$5.00"}]
[8,"MARCO MOGOLLÓN","SIMJANG","2025-01-24",{"v":5,"d":"$5.00"},null,30896816]
[9,"MARIUXI NIETO","SIMJANG","2025-01-24",{"v":5,"d":"$5.00"}]
[10,"KERLY QUINTANA","SIMJANG","2025-01-24",{"v":5,"d":"$5.00"}]
[11,"HARMÍN MONTENEGRO","SIMJANG","2025-01-24",{"v":5,"d":"$5.00"}]
[12,"JOHAN VÁSQUEZ","PALADINS MARCIAL CLUB","2025-01-24",{"v":5,"d":"$5.00"},null,38821702]
[13,"JEANN PALADINES","PALADINS MARCIAL CLUB","2025-01-24",{"v":5,"d":"$5.00"}]
[14,"SANDRA ALVEAR","DOJANG TKD MELO","2025-01-24",{"v":5,"d":"$5.00"},null,54767985]
[15,"JORGE PROAÑO","BAEKJUL","2025-01-24",{"v":5,"d":"$5.00"},null,28687670]
[16,"ERICK PROAÑO","BAEKJUL","2025-01-24",{"v":5,"d":"$5.00"}]
[17,"JOHANN PROAÑO","BAEKJUL","2025-01-24",{"v":5,"d":"$5.00"}]
[18,"DIEGO MERINO","MOODUKKWANTRAININGCENTER","2025-01-24",{"v":5,"d":"$5.00"}]
[19,"EDGAR LEMA","DRAGON LEE GYM","2025-01-24",{"v":5,"d":"$5.00"},null,56027749]
[20,"MARLON QUJIJE","ECUADOR","2025-01-24",{"v":5,"d":"$5.00"}]
[21,"JORGE H. ASTUDILLO C.","ECUADOR","2025-01-24",{"v":5,"d":"$5.00"}]
[22,"DARIO FLORES ","SCORPIUS","2025-01-25",{"v":5,"d":"$5.00"}]
[23,"FRANCISCO CHICAIZA","KUKKIWON","2025-01-27",{"v":5,"d":"$5.00"}]
[24,"DAVID CHICAIZA","KUKKIWON","2025-01-27",{"v":5,"d":"$5.00"}]
[25,"CRISTIÁN CHICAIZA","KUKKIWON","2025-01-27",{"v":5,"d":"$5.00"}]
[26,"EDISON RODRÍGUEZ","DRACO","2025-01-27",{"v":5,"d":"$5.00"}]
[27,"JEFFERSON QUICALIQUIN","L. D. C. MEJÍA","2025-01-27","CUENTA ASO"]
[28,"JORGE TOAPANTA","L. D. C. MEJÍA","2025-01-27","CUENTA ASO"]
[29,"VICENTE LASCANO","TAE DO ACADEMY","2025-01-27",{"v":5,"d":"$5.00"}]
[30,"ALISSON ARMIJOS","TAE DO ACADEMY","2025-01-27",{"v":5,"d":"$5.00"}]
[31,"MATEO PARRA","ILYO M. P.","2025-01-27",{"v":5,"d":"$5.00"}]
[32,"MIGUEL PARRA","ILYO M. P.","2025-01-27",{"v":5,"d":"$5.00"}]
[33,"DARIEL MOSQUERA","SEUL","2025-01-24",{"v":5,"d":"$5.00"},null,50698254]
[34,"ESTEBAN TORRES","SEUL","2025-01-24",{"v":5,"d":"$5.00"},null,37091631]
[35,"STEVEN LÓPEZ","TEKKEN","2025-01-24",{"v":5,"d":"$5.00"}]
[36,"GUSTAVO LÓPEZ","TEKKEN","2025-01-24",{"v":5,"d":"$5.00"}]
[37,"XAVIER MOREIRA ","PIONERO FORTIS","2025-01-24",{"v":5,"d":"$5.00"},null,27646026]
[38,"MIGUEL AGUAS","DRAGON GYM","2025-01-27",{"v":5,"d":"$5.00"},null,29255640]
[39,"SILVIA MOPOSITA","DRAGON GYM","2025-01-27",{"v":5,"d":"$5.00"}]
[40,"PATRICIA TÚQUERES","TAE WOONG","2025-01-27","CUENTA ASO",null,5486730]
[41,"SARA TÚQUERES","TAE WOONG","2025-01-27",{"v":5,"d":"$5.00"},null,41999270]
[42,"EMILY VALERIA PEREZ","TAEGUK JUCARO","2025-01-25",{"v":5,"d":"$5.00"}]
[43,"ETHAN PROAÑO","DRACO","2025-01-27",{"v":5,"d":"$5.00"}]
[44,"JENNY BARROS","KUMGANG DUL","2025-01-27",{"v":5,"d":"$5.00"},null,49956677]
[45,"CARLOS ALARCÓN","BAEKJUL","2025-01-27",{"v":5,"d":"$5.00"},null,29609189]
[46,"GABRIELA CASTILLO","MOODOKKWAN TRAINING CENTER","2025-01-27",{"v":5,"d":"$5.00"},null,33745040]
[47,"CARLOS CAIZA","TOTAL KOMBAT","2025-01-28",{"v":5,"d":"$5.00"},null,7213893]
[48,"EDWIN ARTEAGA","TAE BAEK ECUADOR","2025-01-27",{"v":5,"d":"$5.00"}]
[49,"JEAN ARTEAGA","TAE BAEK ECUADOR","2025-01-27",{"v":5,"d":"$5.00"}]
[50,"VANESSA SIERRA","TAE BAEK ECUADOR","2025-01-27",{"v":5,"d":"$5.00"}]
[51,"MICHAEL CADENA","TAE BAEK ECUADOR","2025-01-27",{"v":5,"d":"$5.00"}]
[52,"JONNY DIGUENCIA","TAE BAEK ECUADOR","2025-01-27",{"v":5,"d":"$5.00"}]
[53,"CHRISTIAN FLORES","LOBOS","2025-01-27",{"v":5,"d":"$5.00"},null,59559706]
[54,"ELIANA ANDRADE","TOTAL KOMBAT","2025-01-27",{"v":5,"d":"$5.00"},null,36573069]
[55,null,"KOREAN DRAGON","2025-01-27",{"v":5,"d":"$5.00"},null,40353538]
[56,null,"KOREAN DRAGON","2025-01-27",{"v":5,"d":"$5.00"}]
[57,"JONATAN BASTIDAS","BAS PANTHERS","2025-01-25","CUENTA ASO"]
[58,"BETTY BASTIDAS","BAS PANTHERS","2025-01-25","CUENTA ASO"]
[59,"ANDRÉS HERRERA","PANDA DEMON","2025-01-27",{"v":5,"d":"$5.00"},null,45959991]
[60,null,"PANDA DEMON","2025-01-27",{"v":5,"d":"$5.00"},null,50567046]
[61,"LUIS GRADA","MARCIAL CLUB GRANDA","2025-01-27",{"v":5,"d":"$5.00"},null,37151342]
[62,"STEVEN ARRIETA","ESPE","2025-01-25",{"v":5,"d":"$5.00"}]
[63,"WILLIAM COLA","SOCIEDAD DEPORTIVA CENTAL","2025-01-27",{"v":5,"d":"$5.00"},null,16404059]
[64,"JULIO ÁLVAREZ","SOCIEDAD DEPORTIVA CENTAL","2025-01-25",{"v":5,"d":"$5.00"}]
[65,"HUGO SIGCHOS","PYONGYANG","2025-01-27",{"v":5,"d":"$5.00"},null,5925465]
[66,"PAUL S{ANCHEZ","MICHAY DO","2025-01-27",{"v":5,"d":"$5.00"},null,48148784]
[67,null,"FURIA NEGRA","2025-01-27","CUENTA ASO"]
[68,null,"FURIA NEGRA","2025-01-27","CUENTA ASO"]
[69,null,"RAIG DE LLUM","2025-01-27",{"v":5,"d":"$5.00"},null,48029958]
[70,"LENIN STEEVEN GOMEZ","FITT KWONDO MEJÍA","2025-01-27","CUENTA ASO"]
[71,"MILTON RAMOS","RENACER","2025-01-24","CUENTA ASO"]
[72,"DAYANA FOLLECO","KORYO","2025-01-23",{"v":5,"d":"$5.00"}]
[73,"MARCO VITERI ","KORYO","2025-01-23",{"v":5,"d":"$5.00"}]
[74,"KEVIN MOLINA","ARES","2025-01-27",{"v":5,"d":"$5.00"},null,43993931]
[75,"ALEXANDER MALITAXI","ARES","2025-01-24",{"v":5,"d":"$5.00"}]
[76,"GUILLERMO PUGA ","KORYO","2025-02-13",{"v":5,"d":"$5.00"}]
[77,"SHARON LÓPEZ","KORYO","2025-02-13",{"v":5,"d":"$5.00"}]
[{"$nulls":3},"TOTAL",{"$f":"SUM(E3:E79)","v":{"v":340,"d":"$340.00"}},"CUENTA DAYO"]
[{"$nulls":3},"TOTAL",{"$f":"(COUNTIF(E3:E77,\"CUENTA ASO\"))*5","v":{"v":45,"d":"$45.00"}},"CUENTA ASOTKD-P"]

{"sheet":"EGRESOS","index":14,"n_rows":312,"n_cols":7,"rows_kept":312,"merged":[[1,0,2,3]]}
[]
["EGRESOS",{"$nulls":5},"TOTAL"]
[{"$nulls":6},{"$f":"SUM(F6:F307)","v":{"v":37153.02,"d":"$ 37,153.02"}}]
[]
[{"$nulls":5},"SUBTOTAL"]
["FECHA","OFICINA Y TECNOLOGÍA","DETALLE","VALOR",null,{"$f":"SUM(D7:D38)","v":{"v":490.82000000000005,"d":"$ 490.82"}}]
["2024-09-05",null,"COMPRA DE CARPETAS Y GRABADO DE CD PARA TRÁMITES",{"v":1.4,"d":"$ 1.40"}]
["2024-09-06",null,"COMPRA DE MASKING",{"v":0.75,"d":"$ 0.75"}]
["2024-09-26",null,"COMPRA DE TINTA PARA IMPRESORA (PACK DE 4 COLORES)",{"v":20,"d":"$ 20.00"}]
["2024-09-26",null,"ADAPTADOR VGA A HDMI CABLE",{"v":10,"d":"$ 10.00"}]
["2024-09-26",null,"COMPRA DE RESMA DE PAPEL",{"v":3.75,"d":"$ 3.75"}]
["2024-10-28",null,"BORRADOR",{"v":0.3,"d":"$ 0.30"}]
["2024-11-08",null,"ESTILITE",{"v":0.6,"d":"$ 0.60"}]
["2024-11-14",null,"COMPRA DE MARCADOR PERMANENTE (X2 COLOR NEGRO)",{"v":1.5,"d":"$ 1.50"}]
["2024-11-14",null,"COMPRA DE CARPETAS Y GRABADO DE CD PARA TRÁMITES",{"v":2.5,"d":"$ 2.50"}]
["2024-11-14",null,"COMPRA DE MARCADOR DE ACETATO (X2 COLOR NEGRO)",{"v":1.3,"d":"$ 1.30"}]
["2024-11-15",null,"COMPRA DE TIJERAS (X2)",{"v":1,"d":"$ 1.00"}]
["2025-11-27",null,"COMPRA MASKING",{"v":0.3,"d":"$ 0.30"}]
["2025-12-02",null,"COMPRA DE PILAS PARA MOUSE INALÁMBRICO",{"v":1.1,"d":"$ 1.10"}]
["2025-12-09",null,"COMPRA DE TONER  PARA IMPRESORA HP LÁSER",{"v":35,"d":"$ 35.00"}]
["2025-12-16",null,"COMPRA DE CARTULINAS A4 Y REGLA DE 30 CENTÍMETROS",{"v":1,"d":"$ 1.00"}]
["2025-01-23",null,"COMPRA DE PILAS PARA MOUSE INALÁMBRICO",{"v":1.1,"d":"$ 1.10"}]
["2025-01-23",null,"COMPRA DE RESMA DE PAPEL Y CARTULINAS",{"v":4.75,"d":"$ 4.75"}]
["2025-01-23",null,"COMPRA DE CINTA ADHESIVA ",{"v":4.5,"d":"$ 4.50"}]
["2025-01-28",null,"COMPRA DE 1 ESTILETE",{"v":0.75,"d":"$ 0.75"}]
["2025-01-28",null,"COMPRA DE CARPETAS DE CARTÓN",{"v":0.5,"d":"$ 0.50"}]
["2025-01-30",null,"COMPRA DE MARCADORES PERMANENTES",{"v":2,"d":"$ 2.00"}]
["2025-02-19",null,"COMPRA DE MUEBLES DE OFICNA PARA SALA DE ESTAR PROFESORES (CUADROS, BAMBÚ Y ESCRITORIO)",{"v":91.97,"d":"$ 91.97"}]
["2025-02-24",null,"COMPRA DE CPU HP Y MONITOR 19 PULGADAS (SISTEMA DE ASISTENCIA Y CONTROL DE CÁMARAS)",{"v":275,"d":"$ 275.00"}]
["2025-02-26",null,"COMPRA DE 1 PAQUETE DE 100 STICKS SHEETS NOTES DE OFICINA",{"v":1,"d":"$ 1.00"}]
["2025-02-27",null,"COMPRA DE PILAS PARA BÁSCULAS",{"v":0.8,"d":"$ 0.80"}]
["2025-02-27",null,"COMPRA DE CABLE HDMI (10 METROS)",{"v":10,"d":"$ 10.00"}]
["2025-02-28",null,"COMPRA 2 DE RESMAS DE PAPEL",{"v":9,"d":"$ 9.00"}]
["2025-03-05",null,"COMPRA DE REGLAS DE 20 Y 30 CENNTÍMETROS",{"v":0.85,"d":"$ 0.85"}]
["2025-03-06",null,"COMPRA DE MASKING GRANDE",{"v":1.8,"d":"$ 1.80"}]
["2025-03-06",null,"COMPRA DE MASKING GRANDE",{"v":1.8,"d":"$ 1.80"}]
["2025-03-06",null,"COMPRA DE CINTA DE EMBALAJE",{"v":1.5,"d":"$ 1.50"}]
["2025-03-11",null,"COMPRA 3 PAQUETES DE 100 STICKS SHEETS NOTES DE OFICINA",{"v":3,"d":"$ 3.00"}]
[null,null,"TOTAL",{"$f":"SUM(D7:D38)","v":{"v":490.82000000000005,"d":"$ 490.82"}}]
[]
[]
["FECHA","SUELDOS Y SALARIOS","DETALLE","VALOR",null,{"$f":"SUM(D43:D85)","v":{"v":15533,"d":"$ 15,533.00"}}]
["2024-09-10",null,"PAGO AUXILIAR Y APOYO TATIANA SIMBAÑA AGOSTO (MEDIO TIEMPO)",{"v":250,"d":"$ 250.00"}]
["2024-10-30",null,"PAGO AUXILIAR Y APOYO TATIANA SIMBAÑA SEPTIEMBRE (MEDIO TIEMPO)",{"v":250,"d":"$ 250.00"}]
["2024-11-30",null,"PAGO AUXILIAR Y APOYO TATIANA SIMBAÑA OCTUBRE (MEDIO TIEMPO)",{"v":250,"d":"$ 250.00"}]
["2025-01-07",null,"PAGO AUXILIAR Y APOYO TATIANA SIMBAÑA NOVIEMBRE (MEDIO TIEMPO)",{"v":250,"d":"$ 250.00"}]
["2025-02-07",null,"PAGO AUXILIAR Y APOYO TATIANA SIMBAÑA ENERO (MEDIO TIEMPO)",{"v":250,"d":"$ 250.00"}]
["2025-03-11",null,"PAGO AUXILIAR Y APOYO TATIANA SIMBAÑA FEBRERO (MEDIO TIEMPO)",{"v":250,"d":"$ 250.00"}]
["2024-10-03",null,"PAGO RUTH GUANO SERVICIO DE LIMPIEZA MES DE AGOSTO (MEDIO TIEMPO)",{"v":250,"d":"$ 250.00"}]
["2024-10-03",null,"PAGO RUTH GUANO SERVICIO DE LIMPIEZA MES DE SEPTIEMBRE (MEDIO TIEMPO)",{"v":250,"d":"$ 250.00"}]
["2024-11-30",null,"PAGO RUTH GUANO SERVICIO DE LIMPIEZA MES DE OCTUBRE (MEDIO TIEMPO)",{"v":250,"d":"$ 250.00"}]
["2025-01-07",null,"PAGO RUTH GUANO SERVICIO DE LIMPIEZA MES DE NOVIEMBRE (MEDIO TIEMPO)",{"v":250,"d":"$ 250.00"}]
["2025-12-17",null,"PAGO RUTH GUANO SERVICIO DE LIMPIEZA MES DE DICIEMBRE (MEDIO TIEMPO)",{"v":250,"d":"$ 250.00"}]
["2025-02-07",null,"PAGO RUTH GUANO SERVICIO DE LIMPIEZA MES DE ENERO (MEDIO TIEMPO)",{"v":250,"d":"$ 250.00"}]
["2025-03-11",null,"PAGO RUTH GUANO SERVICIO DE LIMPIEZA MES DE FEBRERO (MEDIO TIEMPO)",{"v":250,"d":"$ 250.00"}]
["2024-09-10",null,"PAGO  SECRETARIA DAYANA FOLLECO AGOSTO",{"v":460,"d":"$ 460.00"}]
["2024-10-30",null,"PAGO  SECRETARIA DAYANA FOLLECO SEPTIEMBRE",{"v":460,"d":"$ 460.00"}]
["2024-11-17",null,"PAGO SERVICIOS DE AUDITORÍA GUILLERMO MORÁN (INFORME DE AUDITORÍA PARA PRESENTACIÓN DE INFORME SEMESTRAL)",{"v":200,"d":"$ 200.00"},"EN EVENTO"]
["2024-11-30",null,"PAGO  SECRETARIA DAYANA FOLLECO OCTUBRE",{"v":460,"d":"$ 460.00"}]
["2025-12-04",null,"PAGO  SECRETARIA DAYANA FOLLECO NOVIEMBRE",{"v":460,"d":"$ 460.00"}]
["2025-01-02",null,"PAGO  SECRETARIA DAYANA FOLLECO DICIEMBRE",{"v":460,"d":"$ 460.00"}]
["2025-02-07",null,"PAGO  SECRETARIA DAYANA FOLLECO ENERO",{"v":470,"d":"$ 470.00"}]
["2025-03-11",null,"PAGO  SECRETARIA DAYANA FOLLECO FEBRERO",{"v":470,"d":"$ 470.00"}]
["2025-02-07",null,"PAGO MARCELO TROYA SERVICIOS ENTRENADOR PROVINCIAL DE APOYO ENERO",{"v":650,"d":"$ 650.00"}]
["2025-03-12",null,"PAGO MARCELO TROYA SERVICIOS ENTRENADOR PROVINCIAL DE APOYO FEBRERO",{"v":650,"d":"$ 650.00"}]
["2025-02-26",null,"PAGO CARLOS MAGALLANES SERVICIOS PROFESIONALES ENTRENADOR PROVINCIAL ENERO",{"v":333.5,"d":"$ 333.50"}]
["2025-03-01",null,"PAGO CARLOS MAGALLANES SERVICIOS PROFESIONALES ENTRENADOR PROVINCIAL ENERO",{"v":200,"d":"$ 200.00"},"EN EVENTO"]
["2025-02-26",null,"PAGO ANDRÉS NICOLALDE SERVICIOS PROFESIONALES ENTRENADOR PROVINCIAL ENERO",{"v":333.5,"d":"$ 333.50"}]
["2025-03-01",null,"PAGO ANDRÉS NICOLALDE SERVICIOS PROFESIONALES ENTRENADOR PROVINCIAL ENERO",{"v":200,"d":"$ 200.00"},"EN EVENTO"]
["2025-02-03",null,"PAGO RAÚL ROJAS SERVICIOS PROFESIONALES ENTRENADOR PROVINCIAL TEMPORAL",{"v":300,"d":"$ 300.00"}]
["2025-02-04",null,"PAGO ARELIS MEDINA SERVICIOS ENTRENADOR PROVINCIAL DE APOYO ENERO",{"v":440,"d":"$ 440.00"}]
["2025-11-17",null,"ESTALIN FERNANDO VILLARROEL SERVICIO DE ENTRENAMIENTO MENTAL MARZO A JULIO",{"v":1500,"d":"$ 1,500.00"},"EN EVENTO"]
["2025-10-01",null,"ESTALIN FERNANDO VILLARROEL SERVICIO DE ENTRENAMIENTO MENTAL SEPTIEMBRE",{"v":600,"d":"$ 600.00"}]
["2025-11-05",null,"ESTALIN FERNANDO VILLARROEL SERVICIO DE ENTRENAMIENTO MENTAL OCTUBRE",{"v":300,"d":"$ 300.00"}]
["2025-12-10",null,"ESTALIN FERNANDO VILLARROEL SERVICIO DE ENTRENAMIENTO MENTAL NOVIEMBRE",{"v":300,"d":"$ 300.00"}]
["2025-01-08",null,"ESTALIN FERNANDO VILLARROEL SERVICIO DE ENTRENAMIENTO MENTAL DICIEMBRE",{"v":300,"d":"$ 300.00"}]
["2025-03-14",null,"ESTALIN FERNANDO VILLARROEL SERVICIO DE ENTRENAMIENTO MENTAL ENERO Y FEBRERO",{"v":600,"d":"$ 600.00"}]
["2024-12-02",null,"APOYO PARA MOVILIZACIÓN SEMANAL A CAYAMBE PROF.  ANDRÉS NICOLALDE ",{"v":20,"d":"$ 20.00"}]
["2025-01-09",null,"APOYO PARA MOVILIZACIÓN SEMANAL A CAYAMBE PROF.  ANDRÉS NICOLALDE ",{"v":20,"d":"$ 20.00"}]
["2025-01-21",null,"APOYO PARA MOVILIZACIÓN SEMANAL A CAYAMBE PROF.  ANDRÉS NICOLALDE ",{"v":20,"d":"$ 20.00"}]
["2025-02-14",null,"APOYO PARA MOVILIZACIÓN SEMANAL A CAYAMBE PROF.  ANDRÉS NICOLALDE ",{"v":20,"d":"$ 20.00"}]
["2025-03-14",null,"PAGO AUXILIAR Y APOYO LOREN BRICEÑO MARZO 20S4 (MEDIO TIEMPO)",{"v":244,"d":"$ 244.00"}]
["VARIOS",null,"CANJE EDUARDO LOACHAMIN (EMISIÓN DE GAL'S 2025 Y DESCUENTOS EN EVENTOS)",{"v":1626.34,"d":"$ 1,626.34"}]
["VARIOS",null,"CANJE EDUARDO LOACHAMIN (EMISIÓN DE GAL'S 2025)",{"v":115.66,"d":"$ 115.66"}]
["VARIOS",null,"CRUCE PERMISO DE FUNCIONAMIENTO GRAND MASTER POR USO DE PÁGINA EN EVENTOS",{"v":70,"d":"$ 70.00"}]
[null,null,"TOTAL",{"$f":"SUM(D43:D85)","v":{"v":15533,"d":"$ 15,533.00"}}]
[]
[]
["FECHA","INTERNET Y TELEFONÍA","DETALLE","VALOR",null,{"$f":"SUM(D90:D103)","v":{"v":539.63,"d":"$ 539.63"}}]
["2024-09-04",null,"SERVICIO DE INTERNET FIJO CELERITY SEPTIEMBRE",{"v":40.5,"d":"$ 40.50"}]
["2024-09-10",null,"PAGO PLAN CELULAR ASOTKDP SEPTIEMBRE",{"v":36.53,"d":"$ 36.53"}]
["2024-10-04",null,"SERVICIO DE INTERNET FIJO CELERITY OCTUBRE",{"v":40.5,"d":"$ 40.50"}]
["2024-10-08",null,"PAGO PLAN CELULAR ASOTKDP OCTUBRE",{"v":36.53,"d":"$ 36.53"}]
["2024-11-05",null,"SERVICIO DE INTERNET FIJO CELERITY NOVIEMBRE",{"v":40.5,"d":"$ 40.50"}]
["2024-11-08",null,"PAGO PLAN CELULAR ASOTKDP NOVIEMBRE",{"v":36.53,"d":"$ 36.53"}]
["2025-12-09",null,"SERVICIO DE INTERNET FIJO CELERITY DICIEMBRE",{"v":40.5,"d":"$ 40.50"}]
["2025-12-09",null,"PAGO PLAN CELULAR ASOTKDP DICIEMBRE",{"v":36.53,"d":"$ 36.53"}]
["2025-01-06",null,"SERVICIO DE INTERNET FIJO CELERITY ENERO",{"v":40.5,"d":"$ 40.50"}]
["2025-01-10",null,"PAGO PLAN CELULAR ASOTKDP ENERO",{"v":36.74,"d":"$ 36.74"}]
["2025-02-05",null,"SERVICIO DE INTERNET FIJO CELERITY FEBRERO",{"v":40.5,"d":"$ 40.50"}]
["2025-02-10",null,"PAGO PLAN CELULAR ASOTKDP FEBRERO",{"v":36.74,"d":"$ 36.74"}]
["2025-03-06",null,"SERVICIO DE INTERNET FIJO CELERITY MARZO",{"v":40.5,"d":"$ 40.50"}]
["2025-03-11",null,"PAGO PLAN CELULAR ASOTKDP MARZO",{"v":36.53,"d":"$ 36.53"}]
[null,null,"TOTAL",{"$f":"SUM(D90:D103)","v":{"v":539.63,"d":"$ 539.63"}}]
[]
[]
["FECHA","ARREGLO Y MANTENIMIENTO DE INSTALACIONES","DETALLE","VALOR",null,{"$f":"SUM(D108:D138)","v":{"v":5688.93,"d":"$ 5,688.93"}}]
["2024-08-28","SE PAGA EL 10-09-2024","COMPRA DE MATERIALES DE FERRETERÍA PARA ARREGLOS CHIMBACALL ARENA, CEMENTO, EMPASTE, ESPÁTULA, BROCHA Y FLETE)",{"v":80.28,"d":"$ 80.28"}]
["2024-09-10",null,"COMPRA DE MATERIALES DE FERRETERÍA  PARA ARREGLOS EN CHIMBACALLE (TUBO PVC, CODO, TEE, CINTA PARA FIJAR, TORNILLOS, DISCO, EMPASTE Y FLETE)",{"v":64.61,"d":"$ 64.61"}]
["2024-09-10",null,"COMPRA DE MATERIALES DE FERRETERÍA  PARA ARREGLOS EN CHIMBACALLE (COMBO 3 LIBRAS HERRAGO)",{"v":9.14,"d":"$ 9.14"}]
["2024-10-15",null,"DUPLICADO DE LLAVES",{"v":0.82,"d":"$ 0.82"}]
["2024-10-23",null,"COMPRA DE CANDADO Y CADENA ASEGURAR PUERTA DE INGRESO A ESCENARIO DE TKD",{"v":7.28,"d":"$ 7.28"}]
["2024-10-28",null,"MANTENIMIENTO Y ALBAÑILERÍA ARNULFO CONGO PAGO DOS SEMANAS",{"v":240,"d":"$ 240.00"}]
["2024-11-08",null,"COMPRA DE CINTA DE PELIGRO (EVITAR PASO A CAMERINOS Y BAÑOS EN REPARACIÓN)",{"v":4.3,"d":"$ 4.30"}]
["2024-11-12",null,"CERRAJERÍA DARWIN HERNÁNDEZCAMBIO DE PUERTAS DE CAMERIONOS Y BAÑOS ESCENARIO DE TKD",{"v":765,"d":"$ 765.00"}]
["2024-11-13",null,"COMPRA DE RODILLO",{"v":2.88,"d":"$ 2.88"}]
["2024-11-13",null,"COMPRA DE PINTURA DE ALTO TRÁFICO (AMARILLA MARCA UNIDAS",{"v":32.2,"d":"$ 32.20"}]
["2024-11-14",null,"COMPRA DE CINTA MASKING (X3)",{"v":7.25,"d":"$ 7.25"}]
["2024-11-14",null,"COMPRA DE RODELA  Y PERNO",{"v":0.4,"d":"$ 0.40"}]
["2024-11-15",null,"COMPRA DE AMARRA PLÁSTICA Y CINTA DE EMPAQUE",{"v":2.26,"d":"$ 2.26"}]
["2024-11-26","LUIS QUINTERO","ARREGLO Y CAMBIO TOTAL DE TUBERÍAS DE BAÑOS (ÁREA DE CAMERINOS)",{"v":300,"d":"$ 300.00"}]
["2024-12-10","LUIS QUINTERO","ARREGLO Y CAMBIO TOTAL DE TUBERÍAS DE BAÑOS (ÁREA DE CAMERINOS)",{"v":900,"d":"$ 900.00"}]
["2024-12-24","LUIS QUINTERO","ARREGLO Y CAMBIO TOTAL DE TUBERÍAS DE BAÑOS (ÁREA DE CAMERINOS)",{"v":450,"d":"$ 450.00"}]
["2025-01-09","LUIS QUINTERO","ARREGLO Y CAMBIO TOTAL DE TUBERÍAS DE BAÑOS (ÁREA DE CAMERINOS)",{"v":120,"d":"$ 120.00"}]
["2025-01-03",null,"DUPLICADO DE LLAVES (PROF. VINICIO MINA)",{"v":3.4,"d":"$ 3.40"}]
["2025-01-06",null,"DUPLICADO DE LLAVES",{"v":1,"d":"$ 1.00"}]
["2025-01-14","LUIS QUINTERO","ABONO ARREGLO Y CAMBIO TOTAL DE TUBERÍAS DE BAÑOS (ÁREA DE CAMERINOS)",{"v":50,"d":"$ 50.00"}]
["2025-01-21","LUIS QUINTERO","COMPRA DE LLAVES PRISMÁTICAS, URINARIO Y DUCHAS",{"v":200,"d":"$ 200.00"}]
["2025-01-23","LUIS QUINTERO","COMPRA DE EMPAQUE PARA URINARIOS ",{"v":18,"d":"$ 18.00"}]
["2025-01-24","LUIS QUINTERO","RECORTES DE PUERTAS Y COLOCACIÓN DE 6 LÁMPARAS LED EN BAÑOS",{"v":100,"d":"$ 100.00"}]
["2025-01-27",null,"DUPLICADO DE LLAVES",{"v":0.85,"d":"$ 0.85"}]
["2025-02-10",null,"COMPRA DE LLAVE DE COCINA PARA LAVABO (SALA DE ESTAR)",{"v":7.8,"d":"$ 7.80"}]
["2025-02-14",null,"ABONO POR INSTALACIÓN DE EQUIPOS DE CONTROL DE INGRESO Y ASISTENCIA",{"v":785,"d":"$ 785.00"}]
["2025-02-05",null,"DUPLICADO DE LLAVES",{"v":2.4,"d":"$ 2.40"}]
["2025-02-25",null,"COMPRA DE 6 METROS DE CABLE GEMELO",{"v":9.56,"d":"$ 9.56"}]
["2025-02-27","PAÚL ORTIZ","PAGO SALDO POR INSTALACIÓN DE EQUIPOS DE CONTROL DE INGRESO Y ASISTENCIA",{"v":784,"d":"$ 784.00"}]
["2025-03-10","DAVID BENAVIDES","PAGO POR INSTALACIÓN DE 7 CÁMARAS DE SEGURIDAD DVR",{"v":734,"d":"$ 734.00"}]
["2025-03-11",null,"COMPRA DE CERRADURA (CHAPA PARA BODEGA ÁREA DE TAEKWONDO PLANTA BAJA)",{"v":6.5,"d":"$ 6.50"}]
[null,null,"TOTAL",{"$f":"SUM(D108:D138)","v":{"v":5688.93,"d":"$ 5,688.93"}}]
[]
[]
["FECHA","AYUDA ECONÓMICA","DETALLE","VALOR",null,{"$f":"SUM(D143:D145)","v":{"v":1950,"d":"$ 1,950.00"}}]
["2025-02-11",null,"SALDO PENDIENTE DE APOYO PARA MUNDIAL DE HONG KONG ÍKER YANGARI ",{"v":600,"d":"$ 600.00"}]
["2025-02-11",null,"SALDO PENDIENTE DE APOYO PARA MUNDIAL DE HONG MARCELO PRADO",{"v":750,"d":"$ 750.00"}]
["2025-02-11",null,"SALDO PENDIENTE DE APOYO PARA MUNDIAL DE HONG VALENTINA MANZANO",{"v":600,"d":"$ 600.00"}]
[null,null,"TOTAL",{"$f":"SUM(D143:D145)","v":{"v":1950,"d":"$ 1,950.00"}}]
[]
[]
["FECHA","TRANSPORTE","DETALLE","VALOR",null,{"$f":"SUM(D150:D176)","v":{"v":213.45,"d":"$ 213.45"}}]
["2024-09-05",null,"MOVILIZACIÓN PARA ENTREGA DE DOCUMENTOS MINISTERIO DEL DEPORTE",{"v":1.5,"d":"$ 1.50"}]
["2024-09-06",null,"MOVILIZACIÓN PARA EDDY CAJIGAL TRAS JORNADA DE ENTRENAMIENTO NOCTURNA CON SELECCIÓN ESTUDIANTIL ",{"v":10,"d":"$ 10.00"}]
["2024-09-12",null,"MOVILIZACIÓN PARA RETIRAR MATERIAL IMPRESO DE LA IMPRENTA",{"v":2,"d":"$ 2.00"}]
["2024-09-16",null,"MOVILIZACIÓN PARA PAGO DE UNIFORMES ASOTKDP VIAJE A PERÚ",{"v":5,"d":"$ 5.00"}]
["2024-09-18",null,"MOVILIZACIÓN PARA COMPRA DE MICAS ",{"v":5,"d":"$ 5.00"}]
["2024-09-26",null,"MOVILIZACIÓN TATIANA SIMBAÑA TAXI COLABORACIÓN EN ASAMBLEA DE INFORME DE GESTIÓN",{"v":2,"d":"$ 2.00"}]
["2024-10-03",null,"MOVILIZACIÓN PARA GESTIONES ",{"v":2,"d":"$ 2.00"}]
["2024-10-10",null,"MOVILIZACIÓN ENTREGA DE DOCUMENTOS ASOTKD - P",{"v":3,"d":"$ 3.00"}]
["2024-10-14",null,"MOVILIZACIÓN NOTARIZAR FACTURAS DE II PAN AM SERIES SUB 22 OPEN 2024 Y COPA KUKKIWON PERÚ 2024",{"v":1,"d":"$ 1.00"}]
["2024-10-21",null,"MOVILIZACIÓN PARA IMPRESIÓN DE PERMISO DE FUNCIONAMIENTO ANUAL",{"v":2,"d":"$ 2.00"}]
["2024-11-06",null,"MOVILIZACIÓN PARA ENTREGA DE DOCUMENTOS MINISTERIO DEL DEPORTE",{"v":3,"d":"$ 3.00"}]
["2024-11-11",null,"MOVILIZACIÓN PARA GESTIONAR AUDITORIO PARA PREMIACIÓN DE NOVIEMBRE (BIBLIOTECA EUGENIO ESPEJO)",{"v":3.5,"d":"$ 3.50"}]
["2024-11-12",null,"MOVILIZACIÓN PARA GESTIONAR LUGAR PARA PREMIACIÓN DE NOVIEMBRE (BIBLITECA EUGENIO ESPEJO, PALACIO DE CRISTAL)",{"v":5,"d":"$ 5.00"}]
["2024-11-13",null,"MOVILIZACIÓN PARA GESTIONAR LUGAR PARA PREMIACIÓN DE NOVIEMBRE (SALÓN DE LA CIUDAD)",{"v":2,"d":"$ 2.00"}]
["2024-11-13",null,"PAGO DE PALETS Y FLETE ",{"v":25,"d":"$ 25.00"}]
["2024-11-14",null,"MOVILIZACIÓN PARA ENTREGA DE DOCUMENTOS MINISTERIO DEL DEPORTE",{"v":4,"d":"$ 4.00"}]
["2024-11-18",null,"COMPLETAR PAGO DE FLETE DE MENAJE DE EVENTO",{"v":16.1,"d":"$ 16.10"}]
["2024-11-21",null,"MOVILIZACIÓN PARA GESTIONES VARIAS ",{"v":5,"d":"$ 5.00"}]
["2025-01-27",null,"MOVILIZACIÓN PARA GESTÓN Y ENTREGA DE DOCUMENTOS",{"v":5,"d":"$ 5.00"}]
["2025-01-31",null,"MOVILIZACIÓN A IMPRENTA ",{"v":6,"d":"$ 6.00"}]
["2025-02-03",null,"MOVILIZACIÓN A IMPRENTA RETIRAR CERTIFICADOS DE ASCENSO",{"v":6,"d":"$ 6.00"}]
["2025-03-11",null,"MOVILIZACIÓN A IMPRENTA PARA RETIRAR STICKERS ASOTKDP",{"v":4.15,"d":"$ 4.15"}]
["2025-03-11",null,"MOVILIZACIÓN GESTIONES PUCE Y BANCO",{"v":6,"d":"$ 6.00"}]
["2025-02-13",null,"MOVILIZACIÓN PARA COMPRA DE MICAS ",{"v":4.2,"d":"$ 4.20"}]
["2025-02-26",null,"MOVILIZACIÓN Y GESTIONES MINISTERIO DEL DEPORTE",{"v":20,"d":"$ 20.00"}]
["2025-02-28",null,"PAGO DE FLETES PARA EVENTO DE 1 Y 2 DE MARZO TRAMO COLISEO \"LOS QUITUS\"  -  COLISEO \"RUMIÑAHUI\"",{"v":60,"d":"$ 60.00"}]
["2025-05-13",null,"MOVILIZACIÓN Y GESTIONES PARA CEREMONIA DE ASCENSO ASOTKDP",{"v":5,"d":"$ 5.00"}]
[null,null,"TOTAL",{"$f":"SUM(D150:D176)","v":{"v":213.45,"d":"$ 213.45"}}]
[]
[]
["FECHA","REDES Y PUBLICACIONES","DETALLE","VALOR",null,{"$f":"SUM(D181:D189)","v":{"v":1496.8,"d":"$ 1,496.80"}}]
["2024-10-03",null," MANEJO DE MEDIOS Y REDES SOCIALES AGOSTO",{"v":150,"d":"$ 150.00"}]
["2024-10-03",null," MANEJO DE MEDIOS Y REDES SOCIALES SEPTIEMBRE",{"v":150,"d":"$ 150.00"},"EN EVENTO"]
["2025-11-04",null," MANEJO DE MEDIOS Y REDES SOCIALES  OCTUBRE",{"v":150,"d":"$ 150.00"}]
["2025-12-09",null," MANEJO DE MEDIOS Y REDES SOCIALES  NOVIEMBRE",{"v":150,"d":"$ 150.00"}]
["2024-01-08",null," MANEJO DE MEDIOS Y REDES SOCIALES  DICIEMBRE",{"v":150,"d":"$ 150.00"}]
["2025-02-07",null," MANEJO DE MEDIOS Y REDES SOCIALES  ENERO",{"v":150,"d":"$ 150.00"}]
["2025-03-06",null,"PUBLICACIÓN DIARIO \"LA HORA\" CONVOCATORIA PARA ASAMBLEA ORDINARIA MES DE MARZO",{"v":65.55,"d":"$ 65.55"}]
["2025-03-11",null," MANEJO DE MEDIOS Y REDES SOCIALES  FEBRERO",{"v":150,"d":"$ 150.00"}]
["2025-03-13",null,"PUBLICACIÓN DIARIO \"LA HORA\" NÓMINA DE CLUBES FILIALES",{"v":381.25,"d":"$ 381.25"}]
[null,null,"TOTAL",{"$f":"SUM(D181:D189)","v":{"v":1496.8,"d":"$ 1,496.80"}}]
[]
[]
["FECHA","MATERIAL IMPRESO Y MICAS (GAL)","DETALLE","VALOR",null,{"$f":"SUM(D194:D206)","v":{"v":1298.1,"d":"$ 1,298.10"}}]
["2024-09-11",null,"IMPRESIÓN DE DOCUMENTOS PARA ENTREGAR OFICIO EN CDP (IMPRESORA EN MANTENIMIENTO)",{"v":0.7,"d":"$ 0.70"}]
["2024-09-12",null,"IMPRESIÓN DE 2000 STICKERS ASOTKD - P",{"v":41,"d":"$ 41.00"}]
["2024-09-18",null,"COMPRA DE MICAS PARA CARNETS 4 CAJAS",{"v":16,"d":"$ 16.00"}]
["2024-09-26",null,"IMPRESIÓN INFORME DE GESTIÓN DE PRESIDENCIA E INFORME DE AUDITOR (INFORME MAR-AGO 2024)",{"v":17,"d":"$ 17.00"}]
["2024-10-21",null,"IMPRESIÓN DE PERMISO DE FUNCIONAMIENTO ANUAL",{"v":28,"d":"$ 28.00"}]
["2024-11-18",null,"COMPRA DE MICAS PARA CARNETS 4 CAJAS",{"v":20,"d":"$ 20.00"}]
["2025-12-13",null,"DIPLOMAS PARA PREMIACIÓN ANUAL ASOTKDP",{"v":130,"d":"$ 130.00"}]
["2025-01-10",null,"COMPRA DE MICAS PARA CARNETS 10 CAJAS",{"v":40,"d":"$ 40.00"}]
["2025-01-30",null,"IMPRESIÓN DE SEÑALÉTICA PARA EVENTOS",{"v":10,"d":"$ 10.00"}]
["2025-02-03",null,"IMPRESIONES A BLANCO Y NEGRO",{"v":0.4,"d":"$ 0.40"}]
["2025-02-04",null,"IMPRESIÓN 3000 CETIFICADOS DE ASCENSO Y 10.000 BOLETOS TAQUILLA ASOTKDP",{"v":900,"d":"$ 900.00"}]
["2025-02-13",null,"COMPRA DE MICAS PARA CARNETS 15 CAJAS",{"v":60,"d":"$ 60.00"}]
["2025-03-11",null,"IMPRESIÓN 2000 STICKERS (2X2) ASOTKDP",{"v":35,"d":"$ 35.00"}]
[null,null,"TOTAL",{"$f":"SUM(D194:D206)","v":{"v":1298.1,"d":"$ 1,298.10"}}]
[]
[]
["FECHA","ALIMENTACIÓN Y CAFETERÍA","DETALLE","VALOR",null,{"$f":"SUM(D211:D251)","v":{"v":1795.2699999999988,"d":"$ 1,795.27"}}]
["2024-09-25",null,"RECARGA DE AGUA EN BOTELLONES (HIDRATACIÓN DEPORTISTAS)",{"v":8.1,"d":"$ 8.10"}]
["2024-09-26",null,"COMPRA DE PRODUCTOS PARA CAFETERÍA PARA PRESENTACIÓN DE INFORME DE GESTIÓN MAR - AGO 2024",{"v":14.99,"d":"$ 14.99"}]
["2024-09-26",null,"COMPRA DE TÉ PARA PRESENTACIÓN DE INFORME DE GESTIÓN MAR - AGO 2024",{"v":2.66,"d":"$ 2.66"}]
["2024-09-26",null,"COMPRA DE PRODUCTOS PARA CAFETERÍA (CAFÉ Y AZÚCAR) PRESENTACIÓN DE INFORME DE GESTIÓN MAR - AGO 2025",{"v":2,"d":"$ 2.00"}]
["2024-09-26",null,"COMPRA DE GALLETAS DUCALES  PARA PRESENTACIÓN DE INFORME DE GESTIÓN MAR - AGO 2024",{"v":2.2,"d":"$ 2.20"}]
["2024-10-01",null,"COMPRA DE BEBIDAS (AGUA Y GÜITIG) REUNIÓN PARA CONVENIO INTERINSTITUCIONAL (CON INSTITUTO)",{"v":1.75,"d":"$ 1.75"}]
["2025-10-18",null,"REFRIGERIO POR APOYO EN CLASES DE INICIACIÓN (LOREN BRICEÑO E ÍKER TAPIA)",{"v":3,"d":"$ 3.00"}]
["2024-10-29",null,"COMPRA DE GALÓN DE AGUA (OFICINA)",{"v":1.5,"d":"$ 1.50"}]
["2024-10-30",null,"COMPRA DE SOBRE DE CAFÉ",{"v":1.01,"d":"$ 1.01"}]
["2024-11-07",null,"RECARGA DE AGUA EN BOTELLONES (HIDRATACIÓN DEPORTISTAS)",{"v":8.1,"d":"$ 8.10"}]
["2024-11-17",null,"PAGO DE ALIMENTACIÓN (CONCENTRADO DE DEPORTISTAS DE SELECCIÓN  Y DELEGACIONES INVITADAS A CAMPAMENTOS)",{"v":1000,"d":"$ 1,000.00"},"EN EVENTO"]
["2025-01-07",null,"RECARGA DE AGUA EN BOTELLONES (HIDRATACIÓN DEPORTISTAS)",{"v":6.07,"d":"$ 6.07"}]
["2025-01-14",null,"RECARGA DE AGUA EN BOTELLONES (HIDRATACIÓN DEPORTISTAS)",{"v":2.02,"d":"$ 2.02"}]
["2025-01-19",null,"COMPRA DE AGUA HIDRATACIÓN DE DEPORTISTAS",{"v":3.4,"d":"$ 3.40"}]
["2025-01-19",null,"COMPRA DE FUNDAS PARA ENTREGA DE LÍNEA DE ROPA ASOTKDP",{"v":2.75,"d":"$ 2.75"}]
["2025-01-23",null,"COMPRA DE PRODUCTOS PARA CAFETERÍA ",{"v":0.55,"d":"$ 0.55"}]
["2025-01-23",null,"COMPRA DE VASOS COLABORACIÓN CURSO DE ARBITRAJE FETKD",{"v":4,"d":"$ 4.00"}]
["2025-01-25",null,"COMPRA DE REFRIGERIO REUNIÓN DE DIRECTORIO",{"v":95.8,"d":"$ 95.80"}]
["2025-01-27",null,"COMPRA DE BOTELLÓN DE AGUA (HIDRATACIÓN DEPORTISTAS)",{"v":3.1,"d":"$ 3.10"}]
["2025-01-28",null,"RECARGA DE AGUA EN BOTELLONES (HIDRATACIÓN DEPORTISTAS)",{"v":8.1,"d":"$ 8.10"}]
["2025-02-05",null,"RECARGA DE AGUA EN BOTELLONES (HIDRATACIÓN DEPORTISTAS)",{"v":6.07,"d":"$ 6.07"}]
["2025-02-11",null,"COMPRA DE PRODUCTOS PARA CAFETERÍA",{"v":4.04,"d":"$ 4.04"}]
["2025-02-11",null,"COMPRA DE REFRIGERIO REUNIÓN DE TRABAJO",{"v":3.6,"d":"$ 3.60"}]
["2025-02-11",null,"RECARGA DE AGUA EN BOTELLONES (HIDRATACIÓN DEPORTISTAS)",{"v":4.05,"d":"$ 4.05"}]
["2025-02-13",null,"COMPRA DE CUCHARAS Y PLATOS FESTEJO DE CUMPLEAÑOS DEPORTISTAS",{"v":1.8,"d":"$ 1.80"}]
["2025-02-25",null,"COMPRA DE PRODUCTOS PARA CAFETERÍA (CAFÉ, AZÚCAR Y AGUA MINERAL CON GAS) ",{"v":6.34,"d":"$ 6.34"}]
["2025-03-07",null,"COMPRA DE PIZZA PARA REPRESENTANTES DEL EQUIPO FEMENINO DE FÚTBOL ASOTKDP CAMPEONAS 2025",{"v":65,"d":"$ 65.00"}]
["2025-03-08",null,"HIBRATACIÓN  DEPORTISTAS CATEGORÍA MENORES RUMBO A CAMPEONATO NACIONAL",{"v":40,"d":"$ 40.00"}]
["2025-03-08",null,"CENA (PIZZAS) DEPORTISTAS CATEGORÍA MENORES RUMBO A CAMPEONATO NACIONAL",{"v":100,"d":"$ 100.00"}]
["2025-01-23",null,"COMPRA DE BOTELLAS DE AGUA COLABORACIÓN CURSO DE ARBITRAJE FETKD",{"v":2.5,"d":"$ 2.50"}]
["2025-01-23",null,"COMPRA DE PRODUCTOS PARA CAFETERÍA (CAFÉ, AZÚCAR Y AGUA) COLABORACIÓN CURSO DE ARBITRAJE FETKD",{"v":10.6,"d":"$ 10.60"}]
["2025-01-23",null,"COMPRA DE BOTELLÓN DE AGUA COLABORACIÓN CURSO DE ARBITRAJE FETKD",{"v":3.85,"d":"$ 3.85"}]
["2025-01-23",null,"COMPRA DE VASOS PLÁSTICO COLABORACIÓN CURSO DE ARBITRAJE FETKD",{"v":1.6,"d":"$ 1.60"}]
["2025-01-23",null,"COMPRA DE BOTELLA DE AGUA",{"v":0.55,"d":"$ 0.55"}]
["2025-02-13",null,"COMPRA DE PASTELES PARA FESTEJO DE CUMPLEAÑEROS DE SELECCIÓN MES DE ENERO",{"v":14.85,"d":"$ 14.85"}]
["2025-02-18",null,"REFRIGERIO CAMPAÑA PROMOCIONAL DE COMPETENCIA DE POOMSAE DEMOSTRATIVA EN MITAD DEL MUNDO",{"v":80,"d":"$ 80.00"}]
["VARIOS",null,"PAGO ALIMENTACIÓN (ALMUERZO) DEPORTISTAS DE SELECCIÓN  Y DELEGACIONES INVITADAS A CAMPAMENTOS",{"v":235,"d":"$ 235.00"}]
["2025-03-05",null,"COMPRA DE PRODUCTOS PARA CAFETERÍA ",{"v":2.2,"d":"$ 2.20"}]
["2025-03-05",null,"RECARGA DE AGUA EN BOTELLONES (HIDRATACIÓN DEPORTISTAS)",{"v":6.07,"d":"$ 6.07"}]
["2025-03-14",null,"COMPRA DE DETALLES PARA CEREMONIA DE ASCENSO ESCUELA DE INICIACIÓN ASOTKDP",{"v":29.45,"d":"$ 29.45"}]
["VARIOS",null,"COMPRA DE PRODUCTOS DE CAFETERÍA Y SNAKS",{"v":6.6,"d":"$ 6.60"}]
[null,null,"TOTAL",{"$f":"SUM(D211:D251)","v":{"v":1795.2699999999988,"d":"$ 1,795.27"}}]
[]
[]
["FECHA","PRODUCTOS Y UTENSILIOS DE LIMPIEZA","DETALLE","VALOR",null,{"$f":"SUM(D256:D275)","v":{"v":237.78,"d":"$ 237.78"}}]
["2024-09-05",null,"COMPRA DE DETERGENTE Y SUAVIZANTE (LAVADO DE COBIJAS RESIDENCIA ATKDP)",{"v":4.45,"d":"$ 4.45"}]
["2024-10-02",null,"COMPRA DE DETERGENTE Y SUAVIZANTE (LAVADO DE COBIJAS RESIDENCIA ATKDP)",{"v":5.45,"d":"$ 5.45"}]
["2024-10-15",null,"COMPRA DE GUANTES DE LIMPIEZA Y FUNDAS",{"v":3.6,"d":"$ 3.60"}]
["2024-10-15",null,"COMPRA DE DETERGENTE CLORO LÍQUIDO, DESINFECTANTE FUNDAS PLÁSTICAS",{"v":3.88,"d":"$ 3.88"}]
["2024-10-29",null,"PAGO SERVICIO DE LAVANDERÍA (CHALECOS DE STAFF Y MANTELES ATKDP)",{"v":5.25,"d":"$ 5.25"}]
["2024-11-06",null,"COMPRA DE TOALLAS PARA MANOS (PARA BAÑOS DE LA RESIDENCIA)",{"v":8,"d":"$ 8.00"}]
["2024-11-06",null,"COMPRA DE CLORO, DESINFECTANTE, AMBIENTADOR, JABÓN LIQUIDO, AMBIENTADOR EN PASTILLA Y PAPEL HIGIÉNICO",{"v":6.57,"d":"$ 6.57"}]
["2024-11-06",null,"COMPRA DE PAPEL HIGIÉNICO INDUSTRIAL",{"v":7.4,"d":"$ 7.40"}]
["2024-11-06",null,"PAGO SERVICIO DE LAVANDERÍA (COBIJAS Y SÁBANAS DE RESIDENCIA DE ASOTKDP)",{"v":31.65,"d":"$ 31.65"}]
["2024-11-13",null,"COMPRA DE ESCOBAS (X2)",{"v":7.08,"d":"$ 7.08"}]
["2024-11-19",null,"COMPRA DE GUANTES DE LIMPIEZA ",{"v":1.55,"d":"$ 1.55"}]
["2025-12-12",null,"COMPRA DE GUANTES DE LIMPIEZA ",{"v":1.55,"d":"$ 1.55"}]
["2025-01-07",null,"COMPRA DE TACHO PARA TRAPEADOR",{"v":5.5,"d":"$ 5.50"}]
["2025-01-08",null,"COMPRA DE DETERGENTE, JABÓN ANTIBACTERIAL, ESPONJA Y PAÑOS DE LIMPIEZA",{"v":4.01,"d":"$ 4.01"}]
["2025-01-08",null,"COMPRA DE TRAPEADOR",{"v":2.7,"d":"$ 2.70"}]
["2025-01-08",null,"COMPRA DE PAPEL HIGIÉNICO INDUSTRIAL, FUNDAS  Y GUANTES DE LIMPIEZA",{"v":6.5,"d":"$ 6.50"}]
["2025-01-21",null,"PAGO SERVICIO DE LAVANDERÍA (COBIJAS Y SÁBANAS DE RESIDENCIA DE ASOTKDP)",{"v":76.25,"d":"$ 76.25"}]
["2025-03-05",null,"PAGO SERVICIO DE LAVANDERÍA (COBIJAS Y SÁBANAS DE RESIDENCIA DE ASOTKDP)",{"v":49.15,"d":"$ 49.15"}]
["2025-03-06",null,"PAGO SERVICIO DE LAVANDERÍA (CHALECOS Y MANTELES DE ASOTKDP)",{"v":4.25,"d":"$ 4.25"}]
["2025-03-13",null,"COMPRA DE CLORO (CLOROX)",{"v":2.99,"d":"$ 2.99"}]
[null,null,"TOTAL",{"$f":"SUM(D256:D275)","v":{"v":237.78,"d":"$ 237.78"}}]
[]
[]
["FECHA","OTROS","DETALLE","VALOR",null,{"$f":"SUM(D280:D306)","v":{"v":7909.24,"d":"$ 7,909.24"}}]
["2024-09-24",null,"DOJANG TKD MELO HACE USO DE $4 SALDO A FAVOR PARA TRÁMITE DE CARNETS",{"v":4,"d":"$4.00"}]
["2024-10-01",null,"BAEKJUL TEAM AYALAZ HACE USO DE $6 SALDO A FAVOR PARA TRÁMITE DE CARNETS",{"v":6,"d":"$6.00"}]
["2024-10-07",null,"REPOSICIÓN DE VALORES A CDP POR FACTURAS SALIDA RECREACIONAL PAPALLACTA (11-07-2024)",{"v":75,"d":"$75.00"}]
["2024-10-14",null,"NOTARIZAR FACTURAS DE II PAN AM SERIES SUB 22 OPEN 2024 Y COPA KUKKIWON PERÚ 2024",{"v":4.12,"d":"$4.12"}]
["2024-10-22",null,"DRAGON GYM HACE USO DE $6 SALDO A FAVOR PARA TRÁMITE DE CARNETS",{"v":6,"d":"$6.00"}]
["2024-10-22",null,"PAGO A MANUFACTURAS NEW SPRING POR UNIFORME PARA VIAJE A CUBA OBSEQUIO A DEPORTISTAS",{"v":65,"d":"$65.00"}]
["2024-10-29",null,"PAGO DE UNIFORMES ASOTKD - P INTERNACIONALES PARA PROFESORES VIAJE A CUBA",{"v":63.31,"d":"$63.31"}]
["2024-10-29",null,"NOTARIZAR FACTURAS DE III PANAMSERIES SUB-22 P10 CUBA 2024 Y LA HABANA OPEN 2024",{"v":4.12,"d":"$4.12"}]
["2024-11-17",null,"SOPORTES  DE TELEVISIONES (4 ESTRUCTURAS)",{"v":240,"d":"$ 240.00"},"EN EVENTO"]
["2024-11-17",null,"ABONO A SALDO POR COMPRA DE TATAMI PROF. CARLOS REINOSO",{"v":1200,"d":"$ 1,200.00"}]
["2025-11-28",null,"PAGO MEDALLAS OPEN ASOTKDP (MARÍA SIMBA)",{"v":48,"d":"$48.00"}]
["2024-12-07",null,"LOREN BRICEÑO HACE USO DE $6 SALDO A FAVOR PARA TRÁMITE DE CARNETS",{"v":6,"d":"$6.00"}]
["2024-12-12",null,"SERVICIO DE TRANSPORTE PARA ENTREGA DE DOCUMENTOS",{"v":68.5,"d":"$68.50"}]
["2025-01-13",null,"PAGO MAESTRO DE CEREMONIAS PREMIACIÓN MEJORES DEPORTISTAS 2024",{"v":100,"d":"$100.00"}]
["2025-01-19",null,"PAGO SALDO POR COMPRA DE TATAMI PROF. CARLOS REINOSO",{"v":564.44,"d":"$564.44"},"EN EVENTO"]
["2025-01-19",null,"PAGO TRANSPORTE DE DELEGACIONES (EVENTOS NACIONALES) A SANTIAGO LOGACHO",{"v":1000,"d":"$1,000.00"},"EN EVENTO"]
["2025-01-20",null,"REPOSICIÓN DE EXTENSIÓN GIMNASIO DE PESAS",{"v":10,"d":"$10.00"}]
["2025-01-20",null,"SALIDA EXPOXITORES CURSO DE ACREDITACIÓN (PEDRO GÓMEZ Y MARCELO TROYA)",{"v":120,"d":"$120.00"}]
["2025-02-05",null,"CRUCE DE DEUDA CON BASPANTHERS POR JARROS NAVIDEÑOS PARA DEPORTISTAS DE SELECCIÓN CON GAL'S Y DIPLOMAS",{"v":267.5,"d":"$267.50"}]
["2025-02-10",null,"CRUCE DE DEUDA CON BASPANTHERS POR JARROS NAVIDEÑOS PARA DEPORTISTAS DE SELECCIÓN CON GAL'S",{"v":6.25,"d":"$6.25"}]
["2025-02-12",null,"CRUCE DE DEUDA CON MERCENARIOS ",{"v":324,"d":"$324.00"}]
["2025-02-19",null,"DEVOLUCI{ON A CARLOS REINOSO POR PRÉSTAMO PARA MEDALLAS",{"v":384,"d":"$ 384.00"}]
["2025-02-27",null,"PAGO MEDALLAS OPEN ASOTKDP (MARÍA SIMBA)",{"v":300,"d":"$ 300.00"}]
["2025-03-12",null,"MANTENIMIENTO DE ESCENARIOS POLIDEPORTIVO (COMPRA DE PINTURA, CERÁMICA Y TAPAS DE BAÑO)",{"v":350,"d":"$ 350.00"}]
["2025-03-14",null,"COMPRA DE CENTROS DE MESA CEREMONIA DE ASCENSO ESCUELA DE INICIACIÓN ASOTKDP",{"v":10,"d":"$ 10.00"}]
["2025-03-14",null,"GASTOS VARIOS ASAMBLEA DE INFORME DE GESTIÓN",{"v":250,"d":"$ 250.00"}]
["VARIOS",null,"PAGO ATRASADO PREMIACIÓN SESIÓN SOLEMNE (PULSERAS, PLACAS, MEDALLAS, ETC)",{"v":2433,"d":"$ 2,433.00"}]
[null,null,"TOTAL",{"$f":"SUM(D280:D306)","v":{"v":7909.24,"d":"$ 7,909.24"}}]
[]
[]
[null,"INGRESOS",{"$f":"INGRESOS!G21","v":{"v":52759.05,"d":"$ 52,759.05"}}]
[null,"EGRESOS",{"$f":"G3","v":{"v":37153.02,"d":"$ 37,153.02"}}]
[null,null,{"$f":"C310-C311","v":{"v":15606.030000000006,"d":"$ 15,606.03"}},"SALDO BANCOS"]

{"sheet":"CUENTAS POR COBRAR Y POR PAGAR","index":15,"n_rows":125,"n_cols":7,"rows_kept":125,"merged":[[1,1,1,5],[121,1,121,4],[122,2,122,3],[123,2,123,3],[124,2,124,3]]}
[]
[null,"POR COBRAR",{"$nulls":4},{"$f":"SUM(F4:F121)","v":{"v":6700,"d":"$ 6,700.00"}}]
[]
[null,"AFILIACIONES Y PERMISOS DE FUNCIONAMIENTO 2024",{"$nulls":3},{"$f":"SUM(E6:E8)","v":{"v":250,"d":"$ 250.00"}}]
[null,null,"CLUB","REPRESENTANTE","DEUDA"]
[null,null,{"$f":"'AFILIACIONES Y PERMISOS 2024'!B32","v":"Deciap Norte"},{"$f":"'AFILIACIONES Y PERMISOS 2024'!C32","v":"Joel Mogollon"},{"$f":"'AFILIACIONES Y PERMISOS 2024'!I32","v":{"v":50,"d":"$ 50.00"}}]
[null,null,{"$f":"'AFILIACIONES Y PERMISOS 2024'!B107","v":"Tae Baek Junior Sucursal Solanda"},{"$f":"'AFILIACIONES Y PERMISOS 2024'!C107","v":"Edwin  Arteaga Jr."},{"$f":"'AFILIACIONES Y PERMISOS 2024'!I107","v":{"v":50,"d":"$ 50.00"}}]
[null,null,{"$f":"'AFILIACIONES Y PERMISOS 2024'!B117","v":"Team Tauro Taekwondo"},{"$f":"'AFILIACIONES Y PERMISOS 2024'!C117","v":"José Chiriboga"},{"$f":"'AFILIACIONES Y PERMISOS 2024'!I117","v":{"v":150,"d":"$ 150.00"}}]
[]
[null,"AFILIACIONES Y PERMISOS DE FUNCIONAMIENTO 2025",{"$nulls":3},{"$f":"SUM(E12:E102)","v":{"v":6110,"d":"$ 6,110.00"}}]
[null,null,"CLUB","REPRESENTANTE","DEUDA"]
[null,null,{"$f":"'AFILIACIONES Y PERMISOS 2025'!B11","v":"Apolo"},{"$f":"'AFILIACIONES Y PERMISOS 2025'!C11","v":"Mario Pinto"},{"$f":"'AFILIACIONES Y PERMISOS 2025'!I11","v":{"v":70,"d":"$70.00"}}]
[null,null,{"$f":"'AFILIACIONES Y PERMISOS 2025'!B12","v":"Ares"},{"$f":"'AFILIACIONES Y PERMISOS 2025'!C12","v":"Fernando Manosalvas"},{"$f":"'AFILIACIONES Y PERMISOS 2025'!I12","v":{"v":70,"d":"$70.00"}}]
[null,null,{"$f":"'AFILIACIONES Y PERMISOS 2025'!B13","v":"Atlas Club"},{"$f":"'AFILIACIONES Y PERMISOS 2025'!C13","v":"Edgar Varela"},{"$f":"'AFILIACIONES Y PERMISOS 2025'!I13","v":{"v":70,"d":"$70.00"}}]
[null,null,{"$f":"'AFILIACIONES Y PERMISOS 2025'!B17","v":"Bas Panthers"},{"$f":"'AFILIACIONES Y PERMISOS 2025'!C17","v":"Jonatan Bastidas"},{"$f":"'AFILIACIONES Y PERMISOS 2025'!I17","v":{"v":70,"d":"$70.00"}}]
[null,null,{"$f":"'AFILIACIONES Y PERMISOS 2025'!B18","v":"Bas Panthers Pintag (Sucursal)"},{"$f":"'AFILIACIONES Y PERMISOS 2025'!C18","v":"Jonatan Bastidas"},{"$f":"'AFILIACIONES Y PERMISOS 2025'!I18","v":{"v":50,"d":"$50.00"}}]
[null,null,{"$f":"'AFILIACIONES Y PERMISOS 2025'!B19","v":"Borja Lions"},{"$f":"'AFILIACIONES Y PERMISOS 2025'!C19","v":"Edgar Borja"},{"$f":"'AFILIACIONES Y PERMISOS 2025'!I19","v":{"v":70,"d":"$70.00"}}]
[null,null,{"$f":"'AFILIACIONES Y PERMISOS 2025'!B20","v":"Blue Drangons"},{"$f":"'AFILIACIONES Y PERMISOS 2025'!C20","v":"William Suntaxi"},{"$f":"'AFILIACIONES Y PERMISOS 2025'!I20","v":{"v":70,"d":"$70.00"}}]
[null,null,{"$f":"'AFILIACIONES Y PERMISOS 2025'!B21","v":"Ciudad de Quito"},{"$f":"'AFILIACIONES Y PERMISOS 2025'!C21","v":"Fernando Jaramillo"},{"$f":"'AFILIACIONES Y PERMISOS 2025'!I21","v":{"v":70,"d":"$70.00"}}]
[null,null,{"$f":"'AFILIACIONES Y PERMISOS 2025'!B22","v":"Ciudad de Quito (Sucursal)"},{"$f":"'AFILIACIONES Y PERMISOS 2025'!C22","v":"Adriana Obando"},{"$f":"'AFILIACIONES Y PERMISOS 2025'!I22","v":{"v":50,"d":"$50.00"}}]
[null,null,{"$f":"'AFILIACIONES Y PERMISOS 2025'!B23","v":"Condor"},{"$f":"'AFILIACIONES Y PERMISOS 2025'!C23","v":"Juan Carlos Ramírez"},{"$f":"'AFILIACIONES Y PERMISOS 2025'!I23","v":{"v":70,"d":"$70.00"}}]
[null,null,{"$f":"'AFILIACIONES Y PERMISOS 2025'!B25","v":"Chung Song"},{"$f":"'AFILIACIONES Y PERMISOS 2025'!C25","v":"Carlos Morocho"},{"$f":"'AFILIACIONES Y PERMISOS 2025'!I25","v":{"v":70,"d":"$70.00"}}]
[null,null,{"$f":"'AFILIACIONES Y PERMISOS 2025'!B27","v":"Daigoro"},{"$f":"'AFILIACIONES Y PERMISOS 2025'!C27","v":"Edison Pérez V."},{"$f":"'AFILIACIONES Y PERMISOS 2025'!I27","v":{"v":70,"d":"$70.00"}}]
[null,null,{"$f":"'AFILIACIONES Y PERMISOS 2025'!B28","v":"Daigoro Sucursal  Sector El Beaterio"},{"$f":"'AFILIACIONES Y PERMISOS 2025'!C28","v":"Edison Pérez V."},{"$f":"'AFILIACIONES Y PERMISOS 2025'!I28","v":{"v":50,"d":"$50.00"}}]
[null,null,{"$f":"'AFILIACIONES Y PERMISOS 2025'!B29","v":"Debak TKD"},{"$f":"'AFILIACIONES Y PERMISOS 2025'!C29","v":"Jimmy Bolaños"},{"$f":"'AFILIACIONES Y PERMISOS 2025'!I29","v":{"v":70,"d":"$70.00"}}]
[null,null,{"$f":"'AFILIACIONES Y PERMISOS 2025'!B30","v":"Debak TKD Colegio de Liga"},{"$f":"'AFILIACIONES Y PERMISOS 2025'!C30","v":"Adrián Lara"},{"$f":"'AFILIACIONES Y PERMISOS 2025'!I30","v":{"v":50,"d":"$50.00"}}]
[null,null,{"$f":"'AFILIACIONES Y PERMISOS 2025'!B31","v":"Debak TKD Carcelén Bajo (Sucursal)"},{"$f":"'AFILIACIONES Y PERMISOS 2025'!C31","v":"Jared Vargas"},{"$f":"'AFILIACIONES Y PERMISOS 2025'!I31","v":{"v":50,"d":"$50.00"}}]
[null,null,{"$f":"'AFILIACIONES Y PERMISOS 2025'!B32","v":"Deciap"},{"$f":"'AFILIACIONES Y PERMISOS 2025'!C32","v":"Pablo Tayo"},{"$f":"'AFILIACIONES Y PERMISOS 2025'!I32","v":{"v":70,"d":"$70.00"}}]
[null,null,{"$f":"'AFILIACIONES Y PERMISOS 2025'!B33","v":"Deciap Norte"},{"$f":"'AFILIACIONES Y PERMISOS 2025'!C33","v":"Joel Mogollon"},{"$f":"'AFILIACIONES Y PERMISOS 2025'!I33","v":{"v":50,"d":"$50.00"}}]
[null,null,{"$f":"'AFILIACIONES Y PERMISOS 2025'!B35","v":"Draco"},{"$f":"'AFILIACIONES Y PERMISOS 2025'!C35","v":"Edison Rodríguez"},{"$f":"'AFILIACIONES Y PERMISOS 2025'!I35","v":{"v":70,"d":"$70.00"}}]
[null,null,{"$f":"'AFILIACIONES Y PERMISOS 2025'!B36","v":"Dragon Gym"},{"$f":"'AFILIACIONES Y PERMISOS 2025'!C36","v":"Miguel Aguas"},{"$f":"'AFILIACIONES Y PERMISOS 2025'!I36","v":{"v":70,"d":"$70.00"}}]
[null,null,{"$f":"'AFILIACIONES Y PERMISOS 2025'!B38","v":"Ecuadcuba/ Black Panthers"},{"$f":"'AFILIACIONES Y PERMISOS 2025'!C38","v":"Eddy Cajigal  Kindelan"},{"$f":"'AFILIACIONES Y PERMISOS 2025'!I38","v":{"v":70,"d":"$70.00"}}]
[null,null,{"$f":"'AFILIACIONES Y PERMISOS 2025'!B41","v":"ESPE"},{"$f":"'AFILIACIONES Y PERMISOS 2025'!C41","v":"Eduardo Loachamín"},{"$f":"'AFILIACIONES Y PERMISOS 2025'!I41","v":{"v":70,"d":"$70.00"}}]
[null,null,{"$f":"'AFILIACIONES Y PERMISOS 2025'!B42","v":"ESMIL - Eloy Alfaro"},{"$f":"'AFILIACIONES Y PERMISOS 2025'!C42","v":"Raúl Aucancela"},{"$f":"'AFILIACIONES Y PERMISOS 2025'!I42","v":{"v":70,"d":"$70.00"}}]
[null,null,{"$f":"'AFILIACIONES Y PERMISOS 2025'!B43","v":"Farang"},{"$f":"'AFILIACIONES Y PERMISOS 2025'!C43","v":"Mesias Rojas"},{"$f":"'AFILIACIONES Y PERMISOS 2025'!I43","v":{"v":70,"d":"$70.00"}}]
[null,null,{"$f":"'AFILIACIONES Y PERMISOS 2025'!B44","v":"Fitt kwon do"},{"$f":"'AFILIACIONES Y PERMISOS 2025'!C44","v":"Galo Garzón "},{"$f":"'AFILIACIONES Y PERMISOS 2025'!I44","v":{"v":70,"d":"$70.00"}}]
[null,null,{"$f":"'AFILIACIONES Y PERMISOS 2025'!B45","v":"First Class Calderon"},{"$f":"'AFILIACIONES Y PERMISOS 2025'!C45","v":"Lenin Plazarte"},{"$f":"'AFILIACIONES Y PERMISOS 2025'!I45","v":{"v":70,"d":"$70.00"}}]
[null,null,{"$f":"'AFILIACIONES Y PERMISOS 2025'!B46","v":"Furia Negra"},{"$f":"'AFILIACIONES Y PERMISOS 2025'!C46","v":"Franklin Caiza"},{"$f":"'AFILIACIONES Y PERMISOS 2025'!I46","v":{"v":70,"d":"$70.00"}}]
[null,null,{"$f":"'AFILIACIONES Y PERMISOS 2025'!B47","v":"Grand Master "},{"$f":"'AFILIACIONES Y PERMISOS 2025'!C47","v":"César Tayo"},{"$f":"'AFILIACIONES Y PERMISOS 2025'!I47","v":{"v":70,"d":"$70.00"}}]
[null,null,{"$f":"'AFILIACIONES Y PERMISOS 2025'!B48","v":"Goyang - Ideul"},{"$f":"'AFILIACIONES Y PERMISOS 2025'!C48","v":"Luis Elias Pisuña"},{"$f":"'AFILIACIONES Y PERMISOS 2025'!I48","v":{"v":70,"d":"$70.00"}}]
[null,null,{"$f":"'AFILIACIONES Y PERMISOS 2025'!B49","v":"Han Su"},{"$f":"'AFILIACIONES Y PERMISOS 2025'!C49","v":"Mauricio Valladares"},{"$f":"'AFILIACIONES Y PERMISOS 2025'!I49","v":{"v":70,"d":"$70.00"}}]
[null,null,{"$f":"'AFILIACIONES Y PERMISOS 2025'!B50","v":"Han Kum Do"},{"$f":"'AFILIACIONES Y PERMISOS 2025'!C50","v":"Nicole Tapia"},{"$f":"'AFILIACIONES Y PERMISOS 2025'!I50","v":{"v":200,"d":"$200.00"}}]
[null,null,{"$f":"'AFILIACIONES Y PERMISOS 2025'!B51","v":"Himchari Dojang"},{"$f":"'AFILIACIONES Y PERMISOS 2025'!C51","v":"Claudia Cárdenas"},{"$f":"'AFILIACIONES Y PERMISOS 2025'!I51","v":{"v":70,"d":"$70.00"}}]
[null,null,{"$f":"'AFILIACIONES Y PERMISOS 2025'!B52","v":"Huang Top Gym"},{"$f":"'AFILIACIONES Y PERMISOS 2025'!C52","v":"Guido Mejia"},{"$f":"'AFILIACIONES Y PERMISOS 2025'!I52","v":{"v":70,"d":"$70.00"}}]
[null,null,{"$f":"'AFILIACIONES Y PERMISOS 2025'!B53","v":"Ilyo MP"},{"$f":"'AFILIACIONES Y PERMISOS 2025'!C53","v":"Miguel Parra"},{"$f":"'AFILIACIONES Y PERMISOS 2025'!I53","v":{"v":70,"d":"$70.00"}}]
[null,null,{"$f":"'AFILIACIONES Y PERMISOS 2025'!B54","v":"Ji Do Kwan"},{"$f":"'AFILIACIONES Y PERMISOS 2025'!C54","v":"David Del Castillo"},{"$f":"'AFILIACIONES Y PERMISOS 2025'!I54","v":{"v":70,"d":"$70.00"}}]
[null,null,{"$f":"'AFILIACIONES Y PERMISOS 2025'!B55","v":"Joseon Legacy"},{"$f":"'AFILIACIONES Y PERMISOS 2025'!C55","v":"Fernando Moya"},{"$f":"'AFILIACIONES Y PERMISOS 2025'!I55","v":{"v":70,"d":"$70.00"}}]
[null,null,{"$f":"'AFILIACIONES Y PERMISOS 2025'!B56","v":"JR Sport"},{"$f":"'AFILIACIONES Y PERMISOS 2025'!C56","v":"Juan Carlos Ramírez"},{"$f":"'AFILIACIONES Y PERMISOS 2025'!I56","v":{"v":70,"d":"$70.00"}}]
[null,null,{"$f":"'AFILIACIONES Y PERMISOS 2025'!B57","v":"Juventus"},{"$f":"'AFILIACIONES Y PERMISOS 2025'!C57","v":"Jhony Pavón"},{"$f":"'AFILIACIONES Y PERMISOS 2025'!I57","v":{"v":70,"d":"$70.00"}}]
[null,null,{"$f":"'AFILIACIONES Y PERMISOS 2025'!B60","v":"Ko América Caupicho"},{"$f":"'AFILIACIONES Y PERMISOS 2025'!C60","v":"Bryan Chalcualan"},{"$f":"'AFILIACIONES Y PERMISOS 2025'!I60","v":{"v":50,"d":"$50.00"}}]
[null,null,{"$f":"'AFILIACIONES Y PERMISOS 2025'!B61","v":"Ko América Santo Tomas"},{"$f":"'AFILIACIONES Y PERMISOS 2025'!C61","v":"Bryan Chalcualan"},{"$f":"'AFILIACIONES Y PERMISOS 2025'!I61","v":{"v":50,"d":"$50.00"}}]
[null,null,{"$f":"'AFILIACIONES Y PERMISOS 2025'!B62","v":"Ko América Dragon de Fuego"},{"$f":"'AFILIACIONES Y PERMISOS 2025'!C62","v":"Luis Sandoval"},{"$f":"'AFILIACIONES Y PERMISOS 2025'!I62","v":{"v":50,"d":"$50.00"}}]
[null,null,{"$f":"'AFILIACIONES Y PERMISOS 2025'!B63","v":"Korean Dragon"},{"$f":"'AFILIACIONES Y PERMISOS 2025'!C63","v":"Fabián Moreno"},{"$f":"'AFILIACIONES Y PERMISOS 2025'!I63","v":{"v":70,"d":"$70.00"}}]
[null,null,{"$f":"'AFILIACIONES Y PERMISOS 2025'!B64","v":"Koryo"},{"$f":"'AFILIACIONES Y PERMISOS 2025'!C64","v":"Guillermo Puga - Sharon López"},{"$f":"'AFILIACIONES Y PERMISOS 2025'!I64","v":{"v":70,"d":"$70.00"}}]
[null,null,{"$f":"'AFILIACIONES Y PERMISOS 2025'!B65","v":"Koryo Sucursal"},{"$f":"'AFILIACIONES Y PERMISOS 2025'!C65","v":"Edwin Delgado"},{"$f":"'AFILIACIONES Y PERMISOS 2025'!I65","v":{"v":50,"d":"$50.00"}}]
[null,null,{"$f":"'AFILIACIONES Y PERMISOS 2025'!B66","v":"Koryo Sucursal"},{"$f":"'AFILIACIONES Y PERMISOS 2025'!C66","v":"Dayana Folleco"},{"$f":"'AFILIACIONES Y PERMISOS 2025'!I66","v":{"v":50,"d":"$50.00"}}]
[null,null,{"$f":"'AFILIACIONES Y PERMISOS 2025'!B67","v":"Kukkiwon"},{"$f":"'AFILIACIONES Y PERMISOS 2025'!C67","v":"David Chicaiza"},{"$f":"'AFILIACIONES Y PERMISOS 2025'!I67","v":{"v":70,"d":"$70.00"}}]
[null,null,{"$f":"'AFILIACIONES Y PERMISOS 2025'!B68","v":"Kumgan Dul"},{"$f":"'AFILIACIONES Y PERMISOS 2025'!C68","v":"Fabián García"},{"$f":"'AFILIACIONES Y PERMISOS 2025'!I68","v":{"v":70,"d":"$70.00"}}]
[null,null,{"$f":"'AFILIACIONES Y PERMISOS 2025'!B70","v":"León"},{"$f":"'AFILIACIONES Y PERMISOS 2025'!C70","v":"Romel  Pilaquinga"},{"$f":"'AFILIACIONES Y PERMISOS 2025'!I70","v":{"v":70,"d":"$70.00"}}]
[null,null,{"$f":"'AFILIACIONES Y PERMISOS 2025'!B72","v":"Liga Deportiva Cantonal Mejía"},{"$f":"'AFILIACIONES Y PERMISOS 2025'!C72","v":"Vladimir Viana"},{"$f":"'AFILIACIONES Y PERMISOS 2025'!I72","v":{"v":70,"d":"$70.00"}}]
[null,null,{"$f":"'AFILIACIONES Y PERMISOS 2025'!B74","v":"Lobos"},{"$f":"'AFILIACIONES Y PERMISOS 2025'!C74","v":"Cristian Flores"},{"$f":"'AFILIACIONES Y PERMISOS 2025'!I74","v":{"v":70,"d":"$70.00"}}]
[null,null,{"$f":"'AFILIACIONES Y PERMISOS 2025'!B75","v":"Los Pumas"},{"$f":"'AFILIACIONES Y PERMISOS 2025'!C75","v":"Galo Gavilanez"},{"$f":"'AFILIACIONES Y PERMISOS 2025'!I75","v":{"v":70,"d":"$70.00"}}]
[null,null,{"$f":"'AFILIACIONES Y PERMISOS 2025'!B76","v":"Master Home"},{"$f":"'AFILIACIONES Y PERMISOS 2025'!C76","v":"Marlon Lema"},{"$f":"'AFILIACIONES Y PERMISOS 2025'!I76","v":{"v":70,"d":"$70.00"}}]
[null,null,{"$f":"'AFILIACIONES Y PERMISOS 2025'!B77","v":"Marcial Club Granda"},{"$f":"'AFILIACIONES Y PERMISOS 2025'!C77","v":"Luis Granda"},{"$f":"'AFILIACIONES Y PERMISOS 2025'!I77","v":{"v":70,"d":"$70.00"}}]
[null,null,{"$f":"'AFILIACIONES Y PERMISOS 2025'!B78","v":"Mercenarios"},{"$f":"'AFILIACIONES Y PERMISOS 2025'!C78","v":"Luis Cano"},{"$f":"'AFILIACIONES Y PERMISOS 2025'!I78","v":{"v":70,"d":"$70.00"}}]
[null,null,{"$f":"'AFILIACIONES Y PERMISOS 2025'!B80","v":"Millenium"},{"$f":"'AFILIACIONES Y PERMISOS 2025'!C80","v":"Jean Galora"},{"$f":"'AFILIACIONES Y PERMISOS 2025'!I80","v":{"v":70,"d":"$70.00"}}]
[null,null,{"$f":"'AFILIACIONES Y PERMISOS 2025'!B84","v":"Paladins"},{"$f":"'AFILIACIONES Y PERMISOS 2025'!C84","v":"Jeann Paladines"},{"$f":"'AFILIACIONES Y PERMISOS 2025'!I84","v":{"v":70,"d":"$70.00"}}]
[null,null,{"$f":"'AFILIACIONES Y PERMISOS 2025'!B85","v":"Pandademon"},{"$f":"'AFILIACIONES Y PERMISOS 2025'!C85","v":"Andrés Herrera"},{"$f":"'AFILIACIONES Y PERMISOS 2025'!I85","v":{"v":70,"d":"$70.00"}}]
[null,null,{"$f":"'AFILIACIONES Y PERMISOS 2025'!B86","v":"Pionero Fortis"},{"$f":"'AFILIACIONES Y PERMISOS 2025'!C86","v":"Xavier Moreira Fortis"},{"$f":"'AFILIACIONES Y PERMISOS 2025'!I86","v":{"v":70,"d":"$70.00"}}]
[null,null,{"$f":"'AFILIACIONES Y PERMISOS 2025'!B89","v":"Raig de llum"},{"$f":"'AFILIACIONES Y PERMISOS 2025'!C89","v":"Fernando Ruiz"},{"$f":"'AFILIACIONES Y PERMISOS 2025'!I89","v":{"v":70,"d":"$70.00"}}]
[null,null,{"$f":"'AFILIACIONES Y PERMISOS 2025'!B92","v":"Ryong Tae"},{"$f":"'AFILIACIONES Y PERMISOS 2025'!C92","v":"Diego Merino"},{"$f":"'AFILIACIONES Y PERMISOS 2025'!I92","v":{"v":100,"d":"$100.00"}}]
[null,null,{"$f":"'AFILIACIONES Y PERMISOS 2025'!B93","v":"Rojas Iron First"},{"$f":"'AFILIACIONES Y PERMISOS 2025'!C93","v":"Jorge Rojas"},{"$f":"'AFILIACIONES Y PERMISOS 2025'!I93","v":{"v":70,"d":"$70.00"}}]
[null,null,{"$f":"'AFILIACIONES Y PERMISOS 2025'!B94","v":"S. D. Central"},{"$f":"'AFILIACIONES Y PERMISOS 2025'!C94","v":"Carlos Reinoso"},{"$f":"'AFILIACIONES Y PERMISOS 2025'!I94","v":{"v":70,"d":"$70.00"}}]
[null,null,{"$f":"'AFILIACIONES Y PERMISOS 2025'!B96","v":"San Francisco Tigres"},{"$f":"'AFILIACIONES Y PERMISOS 2025'!C96","v":"Carlos Mejía"},{"$f":"'AFILIACIONES Y PERMISOS 2025'!I96","v":{"v":70,"d":"$70.00"}}]
[null,null,{"$f":"'AFILIACIONES Y PERMISOS 2025'!B98","v":"Scorpius"},{"$f":"'AFILIACIONES Y PERMISOS 2025'!C98","v":"Dario Flores"},{"$f":"'AFILIACIONES Y PERMISOS 2025'!I98","v":{"v":70,"d":"$70.00"}}]
[null,null,{"$f":"'AFILIACIONES Y PERMISOS 2025'!B99","v":"Seúl"},{"$f":"'AFILIACIONES Y PERMISOS 2025'!C99","v":"Galo Garzón"},{"$f":"'AFILIACIONES Y PERMISOS 2025'!I99","v":{"v":70,"d":"$70.00"}}]
[null,null,{"$f":"'AFILIACIONES Y PERMISOS 2025'!B100","v":"Seúl Capelo (Sucursal)"},{"$f":"'AFILIACIONES Y PERMISOS 2025'!C100","v":"Fredy Castillo"},{"$f":"'AFILIACIONES Y PERMISOS 2025'!I100","v":{"v":50,"d":"$50.00"}}]
[null,null,{"$f":"'AFILIACIONES Y PERMISOS 2025'!B101","v":"Seúl Carapungo (Sucursal)"},{"$f":"'AFILIACIONES Y PERMISOS 2025'!C101","v":"José Donoso"},{"$f":"'AFILIACIONES Y PERMISOS 2025'!I101","v":{"v":50,"d":"$50.00"}}]
[null,null,{"$f":"'AFILIACIONES Y PERMISOS 2025'!B102","v":"Seúl Yeong-Gu Carcelen"},{"$f":"'AFILIACIONES Y PERMISOS 2025'!C102","v":"Brusby Muñoz"},{"$f":"'AFILIACIONES Y PERMISOS 2025'!I102","v":{"v":50,"d":"$50.00"}}]
[null,null,{"$f":"'AFILIACIONES Y PERMISOS 2025'!B103","v":"Seúl Gedeon (Sucrusal)"},{"$f":"'AFILIACIONES Y PERMISOS 2025'!C103","v":"José Luís Palacios"},{"$f":"'AFILIACIONES Y PERMISOS 2025'!I103","v":{"v":50,"d":"$50.00"}}]
[null,null,{"$f":"'AFILIACIONES Y PERMISOS 2025'!B104","v":"Seúl Chung UI (sucursal)"},{"$f":"'AFILIACIONES Y PERMISOS 2025'!C104","v":"Juan Manuel Villacres"},{"$f":"'AFILIACIONES Y PERMISOS 2025'!I104","v":{"v":50,"d":"$50.00"}}]
[null,null,{"$f":"'AFILIACIONES Y PERMISOS 2025'!B105","v":"Seúl Vale Todo Capapungo"},{"$f":"'AFILIACIONES Y PERMISOS 2025'!C105","v":"Angél Vayas"},{"$f":"'AFILIACIONES Y PERMISOS 2025'!I105","v":{"v":50,"d":"$50.00"}}]
[null,null,{"$f":"'AFILIACIONES Y PERMISOS 2025'!B106","v":"Seúl La Salle"},{"$f":"'AFILIACIONES Y PERMISOS 2025'!C106","v":"Angelica Guerrero"},{"$f":"'AFILIACIONES Y PERMISOS 2025'!I106","v":{"v":50,"d":"$50.00"}}]
[null,null,{"$f":"'AFILIACIONES Y PERMISOS 2025'!B109","v":"Suryun"},{"$f":"'AFILIACIONES Y PERMISOS 2025'!C109","v":"Edison Gallardo"},{"$f":"'AFILIACIONES Y PERMISOS 2025'!I109","v":{"v":70,"d":"$70.00"}}]
[null,null,{"$f":"'AFILIACIONES Y PERMISOS 2025'!B110","v":"Tae  Baek  Junior"},{"$f":"'AFILIACIONES Y PERMISOS 2025'!C110","v":"Edwin  Arteaga Jr."},{"$f":"'AFILIACIONES Y PERMISOS 2025'!I110","v":{"v":70,"d":"$70.00"}}]
[null,null,{"$f":"'AFILIACIONES Y PERMISOS 2025'!B111","v":"Tae Baek Junior Sucursal Solanda"},{"$f":"'AFILIACIONES Y PERMISOS 2025'!C111","v":"Edwin  Arteaga Jr."},{"$f":"'AFILIACIONES Y PERMISOS 2025'!I111","v":{"v":50,"d":"$50.00"}}]
[null,null,{"$f":"'AFILIACIONES Y PERMISOS 2025'!B113","v":"Tae Kings"},{"$f":"'AFILIACIONES Y PERMISOS 2025'!C113","v":"Jorge Astudillo S."},{"$f":"'AFILIACIONES Y PERMISOS 2025'!I113","v":{"v":70,"d":"$70.00"}}]
[null,null,{"$f":"'AFILIACIONES Y PERMISOS 2025'!B114","v":"Tae Sho Ku"},{"$f":"'AFILIACIONES Y PERMISOS 2025'!C114","v":"Marcelo Ochoa"},{"$f":"'AFILIACIONES Y PERMISOS 2025'!I114","v":{"v":70,"d":"$70.00"}}]
[null,null,{"$f":"'AFILIACIONES Y PERMISOS 2025'!B115","v":"Tae Sho Ku Team Valle (Sucursal)"},{"$f":"'AFILIACIONES Y PERMISOS 2025'!C115","v":"Gissela Estrella"},{"$f":"'AFILIACIONES Y PERMISOS 2025'!I115","v":{"v":50,"d":"$50.00"}}]
[null,null,{"$f":"'AFILIACIONES Y PERMISOS 2025'!B116","v":"TaeDo"},{"$f":"'AFILIACIONES Y PERMISOS 2025'!C116","v":"Vicente Lazcano"},{"$f":"'AFILIACIONES Y PERMISOS 2025'!I116","v":{"v":70,"d":"$70.00"}}]
[null,null,{"$f":"'AFILIACIONES Y PERMISOS 2025'!B118","v":"Taekwondo Jitae"},{"$f":"'AFILIACIONES Y PERMISOS 2025'!C118","v":"Emperatriz Quinga"},{"$f":"'AFILIACIONES Y PERMISOS 2025'!I118","v":{"v":70,"d":"$70.00"}}]
[null,null,{"$f":"'AFILIACIONES Y PERMISOS 2025'!B119","v":"Taekwondo Jucaro"},{"$f":"'AFILIACIONES Y PERMISOS 2025'!C119","v":"Danilo Xavier Peréz"},{"$f":"'AFILIACIONES Y PERMISOS 2025'!I119","v":{"v":70,"d":"$70.00"}}]
[null,null,{"$f":"'AFILIACIONES Y PERMISOS 2025'!B120","v":"Tae Woong"},{"$f":"'AFILIACIONES Y PERMISOS 2025'!C120","v":"Patricia Tuqueres"},{"$f":"'AFILIACIONES Y PERMISOS 2025'!I120","v":{"v":70,"d":"$70.00"}}]
[null,null,{"$f":"'AFILIACIONES Y PERMISOS 2025'!B121","v":"Team Tauro Taekwondo"},{"$f":"'AFILIACIONES Y PERMISOS 2025'!C121","v":"José Chiriboga"},{"$f":"'AFILIACIONES Y PERMISOS 2025'!I121","v":{"v":70,"d":"$70.00"}}]
[null,null,{"$f":"'AFILIACIONES Y PERMISOS 2025'!B122","v":"Team Vencedores"},{"$f":"'AFILIACIONES Y PERMISOS 2025'!C122","v":"Victor Hugo Quishpe"},{"$f":"'AFILIACIONES Y PERMISOS 2025'!I122","v":{"v":70,"d":"$70.00"}}]
[null,null,{"$f":"'AFILIACIONES Y PERMISOS 2025'!B124","v":"Total Kombat"},{"$f":"'AFILIACIONES Y PERMISOS 2025'!C124","v":"Raúl Aucancela"},{"$f":"'AFILIACIONES Y PERMISOS 2025'!I124","v":{"v":70,"d":"$70.00"}}]
[null,null,{"$f":"'AFILIACIONES Y PERMISOS 2025'!B125","v":"Total Kombat Rhinos Sucursal"},{"$f":"'AFILIACIONES Y PERMISOS 2025'!C125","v":"Gustavo Llamuca"},{"$f":"'AFILIACIONES Y PERMISOS 2025'!I125","v":{"v":50,"d":"$50.00"}}]
[null,null,{"$f":"'AFILIACIONES Y PERMISOS 2025'!B127","v":"U. San Francisco  USFQ"},{"$f":"'AFILIACIONES Y PERMISOS 2025'!C127","v":"Carlos Reinoso"},{"$f":"'AFILIACIONES Y PERMISOS 2025'!I127","v":{"v":70,"d":"$70.00"}}]
[null,null,{"$f":"'AFILIACIONES Y PERMISOS 2025'!B129","v":"Universidad Central (CAMU)"},{"$f":"'AFILIACIONES Y PERMISOS 2025'!C129","v":"Anthony Rendón"},{"$f":"'AFILIACIONES Y PERMISOS 2025'!I129","v":{"v":70,"d":"$70.00"}}]
[null,null,{"$f":"'AFILIACIONES Y PERMISOS 2025'!B130","v":"Universidad Hemisferios"},{"$f":"'AFILIACIONES Y PERMISOS 2025'!C130","v":"Raúl Aucancela"},{"$f":"'AFILIACIONES Y PERMISOS 2025'!I130","v":{"v":70,"d":"$70.00"}}]
[null,null,{"$f":"'AFILIACIONES Y PERMISOS 2025'!B132","v":"Venom"},{"$f":"'AFILIACIONES Y PERMISOS 2025'!C132","v":"Eddy Cajigal  K."},{"$f":"'AFILIACIONES Y PERMISOS 2025'!I132","v":{"v":70,"d":"$70.00"}}]
[null,null,{"$f":"'AFILIACIONES Y PERMISOS 2025'!B134","v":"Yong Tiger"},{"$f":"'AFILIACIONES Y PERMISOS 2025'!C134","v":"Wilson Rodríguez"},{"$f":"'AFILIACIONES Y PERMISOS 2025'!I134","v":{"v":70,"d":"$70.00"}}]
[]
[]
[]
[null,"CURSO DE ARBITRAJE DICIEMBRE",{"$nulls":3},{"$f":"SUM(E108:E111)","v":{"v":110,"d":"$110.00"}}]
[null,null,"CLUB","NÚMERO DE LICENCIAS","VALOR"]
[null,null,"TAE KING'S (JORGE ASTUDILLO)",null,{"v":15,"d":"$15.00"}]
[null,null,"TAE SHO KU (ESTRELLA GISSELL)",null,{"v":40,"d":"$40.00"}]
[null,null,"SAN SEBASTIÁN (PEDRO OÑA)",null,{"v":15,"d":"$15.00"}]
[null,null,"DRACO (DILAN SALAZAR)",null,{"v":40,"d":"$40.00"}]
[]
[]
[null,"ACREDITACIÓN ENTRENADORES",{"$nulls":3},{"$f":"SUM(E116:E118)","v":{"v":230,"d":"$230.00"}}]
[null,null,"CLUB ","NÚMERO DE CERTIFICADOS","VALOR"]
[null,null,"APOLO (VARIOS)",null,{"v":150,"d":"$150.00"}]
[null,null,"TAE SHO KU (ESTRELLA GISSELL)",null,{"v":40,"d":"$40.00"}]
[null,null,"ECUADCUBA (EDDY CAJIGAL)",null,{"v":40,"d":"$40.00"}]
[]
[]
[]
[null,"POR PAGAR",{"$nulls":3},{"$f":"SUM(E124:E125)","v":{"v":63,"d":"$ 63.00"}}]
[null,"ACREEDORES","DETALLE",null,"VALOR"]
[null,"CLUBES","SALDOS A FAVOR DE CLUBES EN TRÁMITES DE GAL",null,{"v":23.5,"d":"$ 23.50"}]
[null,"CLUBES","SALDO A FAVOR DE CLUBES EN TRÁMITES DE CERTIFICADOS DE ASCENSO",null,{"v":39.5,"d":"$ 39.50"}]